{"text_format":"1","workbook":"xlsx","n_sheets":28,"sheets":["Mod'Op","Fiche_organisateur_N°1","codes FCI","SCC","Fiche_organisateur_N°2","Rapport de Concours","00","OLD","01","02","03","04","05","06","07","08","09","10","11","12","13","14","15","16","17","18","19","20"],"not_rendered":{"charts":0,"images":3,"macros":1,"external_links":0,"defined_names":25,"comments":0,"pivot_tables":0},"unopened":[],"bounds":{"document_bytes":16777216,"sheet_cells":100000,"rows_first":2000,"rows_last":500,"rows_between":2000,"halvings":0,"cell_chars":16384,"cell_head_chars":4096},"cells_cut":0,"cells_raw":0,"read":"whole","date_system":"1900"}

{"sheet":"Mod'Op","index":0,"n_rows":55,"n_cols":13,"rows_kept":55,"cut":false,"hidden":false,"merged":[[1,2,1,8],[2,2,2,8],[5,1,5,8],[7,1,7,8]]}
[]
[null,null,"COMMISSION D'UTILISATION TROUPEAUX"]
[null,null,"Président : Monsieur Jean Paul Kerihuel - 7, Allée Mme de La Fayette - 29 200 - ST RENAN",null,null,null,null,null,null,null,null,null,"Secrétariat : vous pouvez faire vos remarques dans ce cadre"]
[]
[]
[null,"Epreuve de travail sur Ovins - TRADITIONAL STYLE "]
[]
[null,"Comment utiliser ce fichier ?"]
[]
[null,"Attention",null,null,null,null,null,null,null,null,null,null,"Warning"]
[null,"Ce fichier est conçu pour la gestion des concours TRADITIONAL STYLE 1 ou 2 ou 3 et HWT",null,null,null,null,null,null,null,null,null,null,"This file is designed for the management of TRADITIONAL STYLE CLASS 1 or 2 or 3 contests and HWT"]
[]
[null,"1. Phase préparatoire",null,null,null,null,null,null,null,null,null,null,"1. Preparatory phase"]
[]
[null,"Dans l'onglet \"Fiche Organisateur N°1\" => compléter les cases grises.",null,null,null,null,null,null,null,null,null,null,"In the \"Organizer Form N ° 1\" tab => complete the gray boxes."]
[]
[null,"Dans l'onglet \"Fiche Organisateur N°2\" => compléter les cases grises (Voir recommandations au bas de la feuille)",null,null,null,null,null,null,null,null,null,null,"In the \"Organizer Form N ° 2\" tab => fill in the gray boxes (See recommendations at the bottom of the sheet)"]
[]
[null,"Dans l'onglet \"00\" => compléter les cases gris clair sous le contrôle du juge :  ",null,null,null,null,null,null,null,null,null,null,"In the \"00\" tab => complete the light gray boxes under the supervision of the judge:"]
[null," => liste des épreuves",null,null,null,null,null,null,null,null,null,null," => list of events"]
[null," => pointages attribués (entrer le chiffre simple, la barre de fraction se met automatiquement)",null,null,null,null,null,null,null,null,null,null," => scores awarded (enter the single number, the fraction bar is automatically set)"]
[]
[]
[null,"Si le pointage total n'est pas de 100 points, un message \"ATTENTION : TOTAL non égal à 100\" apparaît.",null,null,null,null,null,null,null,null,null,null,"If the total score is not 100 points, a message \"ATTENTION: TOTAL not equal to 100\" appears."]
[null,"Sinon, le message est \"TOTAL = OK\"",null,null,null,null,null,null,null,null,null,null,"Otherwise, the message is \"TOTAL = OK\""]
[]
[null,"2. Phase de concours",null,null,null,null,null,null,null,null,null,null,"2. Competition phase"]
[]
[null,"Imprimer la feuille (vierge) du concurrent qui doit passer et la donner au juge pour son brouillon.",null,null,null,null,null,null,null,null,null,null,"Print the (blank) sheet of the competitor who must pass and give it to the judge for his draft."]
[]
[null,"Pendant le passage du concurrent, le juge renseigne les cases en gris clair et gris foncé.",null,null,null,null,null,null,null,null,null,null,"During the passage of the competitor, the judge fills in the boxes in light gray and dark grey."]
[]
[null,"Lorsque le concurrent est passé, le juge remet au secrétariat cette feuille de pointage manuscrite renseignée.",null,null,null,null,null,null,null,null,null,null,"When the competitor has passed, the judge gives this completed handwritten score sheet to the secretariat."]
[null,"Le secrétariat retranscrit dans Excel (dans le bon onglet ! ) les pointages sur la feuille du concurrent",null,null,null,null,null,null,null,null,null,null,"The secretariat transcribes in Excell (in the correct tab!) The scores on the competitor's sheet"]
[null,"ATTENTION : bien vérifier que les noms du concurrent et du chien correspondent !",null,null,null,null,null,null,null,null,null,null,"CAUTION: check that the names of the competitor and the dog match!"]
[]
[null,"Pendant le déroulement du concours, les tableaux de l'onglet \"Rapport de concours\" se met à jour",null,null,null,null,null,null,null,null,null,null,"During the course of the competition, the tables in the \"Competition report\" tab are updated"]
[null,"automatiquement en temps réel.",null,null,null,null,null,null,null,null,null,null,"automatically in real time."]
[]
[null,"Pendant le déroulement du concours, il est possible de mettre à jour le classement en appuyant sur le",null,null,null,null,null,null,null,null,null,null,"During the course of the competition, it is possible to update the ranking by pressing the"]
[null,"bouton \"CLASSER\" (Attention : il est possible que le bouton ne fonctionne pas sous open Office).",null,null,null,null,null,null,null,null,null,null,"RANK button (Warning: the button may not work in open Office)."]
[]
[null,"3. Fin du concours",null,null,null,null,null,null,null,null,null,null,"3. End of the competition"]
[]
[null,"Lorsque toutes les feuilles sont saisies, le rapport du concours doit donc être à jour.",null,null,null,null,null,null,null,null,null,null,"When all the sheets are entered, the competition report must therefore be up to date."]
[null,"Il ne reste qu'à appuyer sur le bouton \"CLASSER\" pour que les lignes de concurrents soient dans l'ordre",null,null,null,null,null,null,null,null,null,null,"All you have to do is press the \"RANK\" button so that the lines of competitors are in order."]
[null,"croissant des résultats.",null,null,null,null,null,null,null,null,null,null,"growing results."]
[]
[null,"ATTENTION CEPENDANT : ne pas faire une confiance aveugle à l'informatique !",null,null,null,null,null,null,null,null,null,null,"BE CAREFUL HOWEVER: do not blindly trust IT!"]
[null," => vérifier la cohérence des chiffres et sonder quelques feuilles pour détecter d'éventuelles erreurs…",null,null,null,null,null,null,null,null,null,null," => check the consistency of the figures and probe a few sheets to detect any errors ..."]
[]
[null,"La cellule \"Observations\" du \"Rapport de concours\" doit être renseignée par le juge.",null,null,null,null,null,null,null,null,null,null,"The \"Observations\" cell of the \"Competition report\" must be completed by the judge."]
[null,"Il peut le faire manuellement après impression de la feuille.",null,null,null,null,null,null,null,null,null,null,"He can do it manually after printing the sheet."]
[]
[null,"Lorsque tout est OK, éditer les feuilles pour le juge, la CC et les concurents…",null,null,null,null,null,null,null,null,null,null,"When everything is OK, edit the sheets for the judge, the competitors ..."]

{"sheet":"Fiche_organisateur_N°1","index":1,"n_rows":28,"n_cols":13,"rows_kept":28,"cut":false,"hidden":false,"merged":[[1,2,1,8],[2,2,2,8],[9,2,9,8],[12,4,12,5],[7,1,7,7]]}
[]
[null,null,"COMMISSION D'UTILISATION TROUPEAUX"]
[null,null,"Président : Monsieur Jean Paul Kerihuel - 7, Allée Mme de La Fayette - 29 200 - ST RENAN",null,null,null,null,null,null,null,null,null,"Secrétariat : vous pouvez faire vos remarques dans ce cadre"]
[]
[]
[]
[]
[null,"Epreuve de travail sur Ovins - TRADITIONAL STYLE",null,null,null,null,null,null,"IHT 1"]
[]
[null,null,"Organisateur ==> Fiche N°1"]
[]
[]
[null,null,null,"Date :",null,null," [ JJ.MM.AAAA ]"]
[]
[null,null,null,"ORGANISATEUR :"]
[null,null,null,"Lieu :  "]
[]
[null,null,null,"Contact :"]
[null,null,null,"Coordonnées du contact :"]
[null,null,null,"E-mail :"]
[null,null,null,"Tél. :"]
[]
[]
[null,null,null,"Adresse du rassemblement :"]
[]
[null,null,null,"Concours :",{"$f":"$I$8","v":"IHT 1"}]
[]
[null,null,null,"Juge :"]

{"sheet":"codes FCI","index":2,"n_rows":355,"n_cols":4,"rows_kept":355,"cut":false,"hidden":false,"merged":[]}
[]
[null," NOMS DE RACE FCI    (liste à jour au 28 mai 2015)","CODES RACE\nFCI"," NOMS DE RACE EN LANGUE D'ORIGINE"]
[null,"AFFENPINSCHER",186,"AFFENPINSCHER"]
[null,"AIREDALE TERRIER",7,"AIREDALE TERRIER"]
[null,"AKITA",255,"AKITA"]
[null,"AKITA AMERICAIN",344,"AMERICAN AKITA"]
[null,"ANGLO FRANCAIS DE PETITE VENERIE",325,"ANGLO FRANCAIS DE PETITE VENERIE"]
[null,"ARIEGEOIS",20,"ARIEGEOIS"]
[null,"AZAWAKH",307,"AZAWAKH"]
[null,"BANGKAEW DE THAILANDE",358,"THAI BANGKAEW DOG"]
[null,"BARBET",105,"BARBET"]
[null,"BARBU TCHEQUE",245,"CESKY FOUSEK"]
[null,"BARZOÏ",193,"RUSSKAYA PSOVAYA BORZAYA"]
[null,"BASENJI",43,"BASENJI"]
[null,"BASSET ARTESIEN NORMAND",34,"BASSET ARTESIEN NORMAND"]
[null,"BASSET BLEU DE GASCOGNE",35,"BASSET BLEU DE GASCOGNE"]
[null,"BASSET DE WESTPHALIE",100,"WESTFÄLISCHE DACHSBRACKE"]
[null,"BASSET DES ALPES",254,"ALPENLÄNDISCHE DACHSBRACKE"]
[null,"BASSET FAUVE DE BRETAGNE",36,"BASSET FAUVE DE BRETAGNE"]
[null,"BASSET HOUND",163,"BASSET HOUND"]
[null,"BASSET SUEDOIS",130,"DREVER"]
[null,"BEAGLE",161,"BEAGLE"]
[null,"BEAGLE HARRIER",290,"BEAGLE HARRIER"]
[null,"BEARDED COLLIE",271,"BEARDED COLLIE"]
[null,"BEDLINGTON TERRIER",9,"BEDLINGTON TERRIER"]
[null,"BERGER ALLEMAND",166,"DEUTSCHER SCHÄFERHUND"]
[null,"BERGER AMERICAIN MINIATURE",916,"AMERICAN SHEPERD MINIATURE"]
[null,"BERGER AUSTRALIEN",342,"AUSTRALIAN SHEPHERD"]
[null,"BERGER BERGAMASQUE",194,"CANE DA PASTORE BERGAMASCO"]
[null,"BERGER BLANC SUISSE",347,"BERGER BLANC SUISSE / WEISSER SCHWEIZER SCHAFERHUND"]
[null,"BERGER D'ASIE CENTRALE",335,"SREDNEASIATSKAÏA OVTCHARKA"]
[null,"BERGER DE BEAUCE",44,"BERGER DE BEAUCE"]
[null,"BERGER DE BOSNIE-HERZEGOVINE ET DE CROATIE",355,"TORNJAK"]
[null,"BERGER DE BRIE",113,"BERGER DE BRIE"]
[null,"BERGER DE LA MAREMME ET DES ABRUZZES",201,"CANE DA PASTORE MAREMMANO-ABRUZZESE"]
[null,"BERGER DE LA SERRA DE AIRES",93,"CÃO DA SERRA DE AIRES"]
[null,"BERGER DE L'EUROPE DU SUD-EST",357,"CIOBANESC ROMANESC DE BUCOVINA"]
[null,"BERGER DE PICARDIE",176,""]
[null,"BERGER DE RUSSIE MERIDIONALE",326,"IOUJNOROUSSKAÏA OVTCHARKA"]
[null,"BERGER DES PYRENEES A FACE RASE",138,"BERGER DES PYRENEES A FACE RASE"]
[null,"BERGER DES PYRENEES A POIL LONG",141,"BERGER DES PYRENEES A POIL LONG"]
[null,"BERGER DU CAUCASE",328,"KAVKAZSKAÏA OVTCHARKA"]
[null,"BERGER DU KARST",278,"KRASZKI OVCAR"]
[null,"BERGER FINNOIS DE LAPONIE",284,"LAPINPOROKOIRA"]
[null,"BERGER HOLLANDAIS",223,"HOLLANDSE HERDERSHOND"]
[null,"BERGER POLONAIS DE PLAINE",251,"POLSKI OWCZAREK NIZINNY"]
[null,"BICHON A POIL FRISE",215,""]
[null,"BICHON BOLONAIS",196,"BOLOGNESE"]
[null,"BICHON HAVANAIS",250,"BICHON HAVANAIS"]
[null,"BICHON MALTAIS",65,"MALTESE"]
[null,"BILLY",25,"BILLY"]
[null,"BORDER COLLIE",297,"BORDER COLLIE"]
[null,"BORDER TERRIER",10,"BORDER TERRIER"]
[null,"BOULEDOGUE FRANCAIS",101,"BOULEDOGUE FRANCAIS"]
[null,"BOUVIER AUSTRALIEN",287,"AUSTRALIAN CATTLE DOG"]
[null,"BOUVIER AUSTRALIEN COURTE QUEUE",351,"AUSTRALIAN STUMPY TAIL CATTLE DOG"]
[null,"BOUVIER BERNOIS",45,"BERNER SENNENHUND , DÜRRBÄCHLER"]
[null,"BOUVIER DE L'APPENZELL",46,"APPENZELLER SENNENHUND"]
[null,"BOUVIER DE L'ENTLEBUCH",47,"ENTLEBUCHER SENNENHUND"]
[null,"BOUVIER DES ARDENNES",171,"BOUVIER DES ARDENNES"]
[null,"BOUVIER DES FLANDRES",191,"BOUVIER DES FLANDRES"]
[null,"BOXER",144,"BOXER"]
[null,"BRACHET ALLEMAND",299,"DEUTSCHE BRACKE"]
[null,"BRACHET DE STYRIE A POIL DUR",62,"STEIRISCHE RAUHHAARBRACKE"]
[null,"BRACHET NOIR ET FEU",63,"BRANDLBRACKE"]
[null,"BRACHET POLONAIS",52,"OGAR POLSKI"]
[null,"BRACHET TYROLIEN",68,"TIROLER BRACKE"]
[null,"BRAQUE ALLEMAND A POIL COURT",119,"DEUTSCH KURZHAAR"]
[null,"BRAQUE D AUVERGNE",180,"BRAQUE D'AUVERGNE"]
[null,"BRAQUE DE BURGOS",90,"PERDIGUERO DE BURGOS"]
[null,"BRAQUE DE L ARIEGE",177,"BRAQUE DE L'ARIEGE"]
[null,"BRAQUE DE WEIMAR",99,"WEIMARANER"]
[null,"BRAQUE DU BOURBONNAIS",179,"BRAQUE DU BOURBONNAIS"]
[null,"BRAQUE FRANCAIS, TYPE GASCOGNE",133,""]
[null,"BRAQUE FRANCAIS, TYPE PYRENEES",134,""]
[null,"BRAQUE HONGROIS A POIL COURT",57,"RÖVIDSZÖRU MAGYAR VIZSLA"]
[null,"BRAQUE HONGROIS A POIL DUR",239,"DRÖTZÖRÜ MAGYAR VIZSLA"]
[null,"BRAQUE ITALIEN",202,"BRACCO ITALIANO"]
[null,"BRAQUE SAINT GERMAIN",115,"BRAQUE SAINT GERMAIN"]
[null,"BRAQUE SLOVAQUE A POIL DUR",320,"SLOVENSKI HRUBOSRSTY STAVAC (OHAR)"]
[null,"BRIQUET DE PROVENCE",911,""]
[null,"BRIQUET GRIFFON VENDEEN",19,"BRIQUET GRIFFON VENDEEN"]
[null,"BROHOLMER",315,"BROHOLMER"]
[null,"BRUNO SAINT-HUBERT FRANCAIS",905,"JURA LAUFHUND - CHIEN COURANT"]
[null,"BUHUND NORVEGIEN",237,"NORSK BUHUND"]
[null,"BULL TERRIER",11,"BULL TERRIER"]
[null,"BULL TERRIER MINIATURE",359,"MINIATURE BULL TERRIER"]
[null,"BULLDOG",149,"BULLDOG"]
[null,"BULLMASTIFF",157,"BULLMASTIFF"]
[null,"CAIRN TERRIER",4,"CAIRN TERRIER"]
[null,"CANICHE",172,"CANICHE"]
[null,"CARLIN",253,"PUG"]
[null,"CAVALIER KING CHARLES",136,"CAVALIER KING CHARLES SPANIEL"]
[null,"CHIEN A LOUTRE",294,"OTTERHOUND"]
[null,"CHIEN CHINOIS A CRETE",288,"CHINESE CRESTED DOG"]
[null,"CHIEN COURANT DE BOSNIE A POIL DUR",155,"BOSANSKI OSTRODLAKI GONIC - BARAK"]
[null,"CHIEN COURANT DE HALDEN",267,"HALDENSTOVER"]
[null,"CHIEN COURANT DE HAMILTON",132,"HAMILTONSTOVARE"]
[null,"CHIEN COURANT DE HYGEN",266,"HYGENHUND"]
[null,"CHIEN COURANT DE LA VALLE DE LA SAVE",154,"POSAVSKI GONIC"]
[null,"CHIEN COURANT DE MONTAGNE DU MONTENEGRO",279,"CRNOGORSKI  PLANINSKI GONIC"]
[null,"CHIEN COURANT DE SCHILLER",131,"SCHILLERSTÖVARE"]
[null,"CHIEN COURANT DE TRANSYLVANIE",241,"ERDELYI KOPO"]
[null,"CHIEN COURANT D'ISTRIE A POIL DUR",152,"ISTARSKI OSTRODLAKI GONIC"]
[null,"CHIEN COURANT D'ISTRIE A POIL RAS",151,"ISTARSKI KRATKODLAKI GONIC"]
[null,"CHIEN COURANT DU SMALAND",129,"SMALANDSSTOVARE"]
[null,"CHIEN COURANT ESPAGNOL",204,"SABUESO ESPAÑOL"]
[null,"CHIEN COURANT FINLANDAIS",51,"SUOMENAJOKOIRA"]
[null,"CHIEN COURANT GREC",214,"HELLINIKOS ICHNILATIS"]
[null,"CHIEN COURANT ITALIEN A POIL DUR",198,"SEGUGIO ITALIANO A PELO FORTE"]
[null,"CHIEN COURANT ITALIEN A POIL RAS",337,"SEGUGIO ITALIANO A PELO RAZO"]
[null,"CHIEN COURANT NORVEGIEN",203,"DUNKER"]
[null,"CHIEN COURANT POLONAIS",354,"GONZCY POLSKI"]
[null,"CHIEN COURANT SERBE",150,"SERBSKI GONIC"]
[null,"CHIEN COURANT SLOVAQUE",244,"SLOVENSKY KOPOV"]
[null,"CHIEN COURANT SUISSE",59,"SCHWEIZER LAUFHUND"]
[null,"CHIEN COURANT TRICOLORE SERBE",229,"SERPSKI TROBOJNI GONIC"]
[null,"CHIEN D'ARRET ALLEMAND A POIL DUR",98,"DEUTSCH DRAHTHAAR"]
[null,"CHIEN D'ARRET ALLEMAND A POIL LONG",117," DEUTSCH LANGHAAR"]
[null,"CHIEN D'ARRET ALLEMAND A POIL RAIDE",232,"DEUTSCH STICHELHAAR"]
[null,"CHIEN D'ARRET DANOIS ANCESTRAL",281,"GAMMEL DANSK HONSHUND"]
[null,"CHIEN D'ARRET FRISON",222,"STABYHOUN"]
[null,"CHIEN D'ARRET PORTUGAIS",187,"PERDIGUEIRO PORTUGUES"]
[null,"CHIEN D'ARTOIS",28,"CHIEN D'ARTOIS"]
[null,"CHIEN DE BERGER ANGLAIS ANCESTRAL",16,"OLD ENGLISH SHEEPDOG"]
[null,"CHIEN DE BERGER BELGE",15,"BELGISCHE HERDERSHOND"]
[null,"CHIEN DE BERGER CATALAN",87,"PERRO DE PASTOR CATALAN - GOS D'ATURA CATALA"]
[null,"CHIEN DE BERGER CROATE",277,"HRVATSKI OVCAR"]
[null,"CHIEN DE BERGER D ANATOLIE",331,"COBAN KOPEGI"]
[null,"CHIEN DE BERGER DE MAJORQUE",321,"PERRO DE PASTOR MALLORQUIN - CA DE BESTIAR"]
[null,"CHIEN DE BERGER DES SHETLAND",88,"SHETLAND SHEEPDOG"]
[null,"CHIEN DE BERGER DES TATRAS",252,"POLSKI OWCZAREK PODHALANSKI"]
[null,"CHIEN DE BERGER ISLANDAIS",289,"ISLENSKUR FJARHUNDUR"]
[null,"CHIEN DE BERGER ROUMAIN DE MIORITZA",349,"CIOBANESC ROMÂNESC MIORITIC"]
[null,"CHIEN DE BERGER ROUMAIN DES CARPATHES",350,"CIOBANESC  ROMÂNESC CARPATIN"]
[null,"CHIEN DE BERGER YOUGOSLAVE DE CHARPLANINA",41,"JUGOSLOVENSKI OVCARSKI PAS"]
[null,"CHIEN DE CANAAN",273,"CANAAN DOG"]
[null,"CHIEN DE CASTRO LABOREIRO",170,"CAO DE CASTRO LABOREIRO"]
[null,"CHIEN DE COUR ITALIEN",343,"CANE CORSO"]
[null,"CHIEN DE FERME DANO-SUEDOIS",356,"DANSK-SVENSK GARDSHUND"]
[null,"CHIEN DE GARENNE DES CANARIES",329,"PODENCO CANARIO"]
[null,"CHIEN DE GARENNE PORTUGAIS",94,"PODENGO PORTUGUÈS"]
[null,"CHIEN DE LA SERRA DA ESTRELA",173,"CAO DA SERRA DA ESTRELA"]
[null,"CHIEN DE LEONBERG",145,"LEONBERGER"]
[null,"CHIEN DE MONTAGNE DE L'ATLAS",247,"AÏDI"]
[null,"CHIEN DE MONTAGNE DES PYRENEES",137,"CHIEN DE MONTAGNE DES PYRENEES"]
[null,"CHIEN DE PERDRIX DE DRENTE",224,"DRENTSCHE PATRIJSHOND"]
[null,"CHIEN DE RHODESIE A CRETE DORSALE",146,"RHODESIAN RIDGEBACK"]
[null,"CHIEN DE ROUGE DE BAVIERE",217,"BAYRISCHER GEBIRGSSCHWEISSHUND"]
[null,"CHIEN DE ROUGE DU HANOVRE",213,"HANNOVERSCHER SCHWEISSHUND"]
[null,"CHIEN DE SAINT HUBERT",84,"CHIEN DE SAINT HUBERT"]
[null,"CHIEN DE TAÏWAN",348,"TAÏWAN DOG"]
[null,"CHIEN D'EAU AMERICAIN",301,"AMERICAN WATER SPANIEL"]
[null,"CHIEN D'EAU ESPAGNOL",336,"PERRO DE AGUA ESPAÑOL"]
[null,"CHIEN D'EAU FRISON",221,"WETTERHOUN"]
[null,"CHIEN D'EAU PORTUGAIS",37,"CÃO DE AGUA PORTUGUÊS"]
[null,"CHIEN D'EAU ROMAGNOL",298,"LAGOTTO ROMAGNOLO"]
[null,"CHIEN D'ELAN NORVEGIEN GRIS",242,"NORSK ELKHUND GRA"]
[null,"CHIEN D'ELAN NORVEGIEN NOIR",268,"NORSK ELGHUND SORT"]
[null,"CHIEN D'ELAN SUEDOIS / JÄMTHUND",42,"JÄMTHUND"]
[null,"CHIEN D'OURS DE CARELIE",48,"KARJALANKARHUKOIRA"]
[null,"CHIEN D'OYSEL ALLEMAND",104,"DEUTSCHER WACHTELHUND"]
[null,"CHIEN DU GROENLAND",274,"GRONLANDSHUND"]
[null,"CHIEN DU PHARAON",248,"PHARAOH HOUND"]
[null,"CHIEN FINNOIS DE LAPONIE",189,"SUOMENLAPINKOIRA"]
[null,"CHIEN FONNESE",913,"CANE FONNESE"]
[null,"CHIEN LOUP DE SAARLOOS",311,"SAARLOOS WOLFHOND"]
[null,"CHIEN LOUP TCHECOSLOVAQUE",332,"CESKOSLOVENSKY VECIAK"]
[null,"CHIEN N. ET F. POUR LA CHASSE AU RATON",300,"BLACK AND TAN COONHOUND"]
[null,"CHIEN NORVEGIEN DE MACAREUX",265,"NORSK LUNDEHUND"]
[null,"CHIEN NU DU MEXIQUE",234,"XOLOITZCUINTLE"]
[null,"CHIEN NU DU PEROU",310,"PERRO SIN PELO DEL PERU"]
[null,"CHIEN PARTICOLORE A POIL FRISE",912,"CHIEN PARTICOLORE A POIL FRISE"]
[null,"CHIEN THAILANDAIS A CRETE DORSALE",338,"THAI RIDGEBACK DOG"]
[null,"CHIHUAHUA",218,"CHIHUAHUA"]
[null,"CHOW CHOW",205,"CHOW-CHOW"]
[null,"CIMARRON URUGUAYEN",353,"CIMARRON URUGUAYO"]
[null,"CIRNECO DE L ETNA",199,"CIRNECO DELL'ETNA"]
[null,"CLUMBER SPANIEL",109,"CLUMBER SPANIEL"]
[null,"COCKER SPANIEL AMERICAIN",167,"AMERICAN COCKER SPANIEL"]
[null,"COCKER SPANIEL ANGLAIS",5,"ENGLISH COCKER SPANIEL"]
[null,"COLLIE A POIL COURT",296,"SMOOTH COLLEY"]
[null,"COLLIE A POIL LONG",156,"ROUGH COLLEY"]
[null,"CONTINENTAL BULLDOG",915,"CONTINENTAL BULLDOG"]
[null,"COTON DE TULEAR",283,"COTON DE TULEAR"]
[null,"CROISE",null,"CROISE"]
[null,"CURSINU",901,"U'CURSINU"]
[null,"DALMATIEN",153,"DALMATIEN"]
[null,"DANDIE DINMONT TERRIER",168,"DANDIE DINMONT TERRIER"]
[null,"DOBERMANN",143,"DOBERMANN"]
[null,"DOGUE ALLEMAND",235,"DEUTSCHE DOGGE"]
[null,"DOGUE ARGENTIN",292,"DOGO ARGENTINO"]
[null,"DOGUE DE BORDEAUX",116,"DOGUE DE BORDEAUX"]
[null,"DOGUE DE MAJORQUE",249,"PERRO DOGO MALLORQUIN"]
[null,"DOGUE DES CANARIES",346,"DOGO CANARIO"]
[null,"DOGUE DU TIBET",230,"DO-KHYI"]
[null,"ENGLISH SPRINGER SPANIEL",125,"ENGLISH SPRINGER SPANIEL"]
[null,"EPAGNEUL BLEU DE PICARDIE",106,"EPAGNEUL BLEU DE PICARDIE"]
[null,"EPAGNEUL BRETON",95,"EPAGNEUL BRETON"]
[null,"EPAGNEUL DE PONT AUDEMER",114,"EPAGNEUL DE PONT AUDEMER"]
[null,"EPAGNEUL DE SAINT USUGE",906,"EPAGNEUL DE SAINT USUGE"]
[null,"EPAGNEUL D'EAU IRLANDAIS",124,"IRISH WATER SPANIEL"]
[null,"EPAGNEUL FRANCAIS",175,"EPAGNEUL FRANCAIS"]
[null,"EPAGNEUL JAPONAIS",206,"CHIN"]
[null,"EPAGNEUL KING CHARLES",128,"KING CHARLES SPANIEL"]
[null,"EPAGNEUL NAIN CONTINENTAL",77,""]
[null,"EPAGNEUL PEKINOIS",207,"PEKINGESE"]
[null,"EPAGNEUL PICARD",108,"EPAGNEUL PICARD"]
[null,"EPAGNEUL TIBETAIN",231,"TIBETAN SPANIEL"]
[null,"EURASIER",291,"EURASIEN"]
[null,"FIELD SPANIEL",123,"FIELD SPANIEL"]
[null,"FILA BRASILEIRO",225,"FILA BRASILEIRO"]
[null,"FILA DE SAINT  MIGUEL",340,"CAO DE FILA DE SAO MIGUEL"]
[null,"FOX HOUND ANGLAIS",159,"ENGLISH FOXHOUND"]
[null,"FOX TERRIER POIL DUR",169,"FOX TERRIER WIRE"]
[null,"FOX TERRIER POIL LISSE",12,"FOX TERRIER SMOOTH"]
[null,"FOXHOUND AMERICAIN",303,"AMERICAN FOXHOUND"]
[null,"FRANCAIS BLANC ET NOIR",220,"FRANCAIS"]
[null,"FRANCAIS BLANC ET ORANGE",316,""]
[null,"FRANCAIS TRICOLORE",219,"FRANCAIS"]
[null,"GASCON SAINTONGEOIS",21,"GASCON SAINTONGEOIS"]
[null,"GOLDEN RETRIEVER",111,"GOLDEN RETRIEVER"]
[null,"GRAND ANGLO FRANCAIS BLANC ET NOIR",323,"GRAND ANGLO FRANCAIS"]
[null,"GRAND ANGLO-FRANCAIS BLANC ET ORANGE",324,"GRAND ANGLO-FRANCAIS"]
[null,"GRAND ANGLO-FRANCAIS TRICOLORE",322,"GRAND ANGLO FRANCAIS"]
[null,"GRAND BASSET GRIFFON VENDEEN",33,"GRAND BASSET GRIFFON VENDEEN"]
[null,"GRAND BLEU DE GASCOGNE",22,"GRAND BLEU DE GASCOGNE"]
[null,"GRAND BOUVIER SUISSE",58,"GROSSER SCHWEIZER SENNENHUND"]
[null,"GRAND EPAGNEUL DE MUNSTER",118,"GROSSER MÜNSTERLÄNDER VORSTEHHUND"]
[null,"GRAND GRIFFON VENDEEN",282,"GRAND GRIFFON VENDEEN"]
[null,"GREYHOUND",158,"GREYHOUND"]
[null,"GRIFFON A POIL DUR KORTHALS",107,"GRIFFON A POIL DUR KORTHALS"]
[null,"GRIFFON BELGE",81,"GRIFFON BELGE"]
[null,"GRIFFON BLEU DE GASCOGNE",32,"GRIFFON BLEU DE GASCOGNE"]
[null,"GRIFFON BRUXELLOIS",80,"GRIFFON BRUXELLOIS"]
[null,"GRIFFON FAUVE DE BRETAGNE",66,"GRIFFON FAUVE DE BRETAGNE"]
[null,"GRIFFON NIVERNAIS",17,"GRIFFON NIVERNAIS"]
[null,"HARRIER",295,"HARRIER"]
[null,"HOKKAIDO",261,"HOKKAIDO"]
[null,"HOVAWART",190,"HOVAWART"]
[null,"HUSKY DE SIBERIE",270,"SIBERIAN HUSKY"]
[null,"JINDO COREEN",334,"KOREA JINDO DOG"]
[null,"KAI",317,"KAI"]
[null,"KELPIE AUSTRALIEN",293,"AUSTRALIAN KELPIE"]
[null,"KISHU",318,"KISHU"]
[null,"KOMONDOR",53,"KOMONDOR"]
[null,"KROMFOHRLANDER",192,"KROMFOHRLÄNDER"]
[null,"KUVASZ",54,"KUVASZ"]
[null,"LAIKA DE SIBERIE OCCIDENTALE",306,"ZAPADNO SIBIRSKAÏA LAÏKA"]
[null,"LAIKA DE SIBERIE ORIENTALE",305,"VOSTOTCHNO SIBIRSKAÏA LAÏKA"]
[null,"LAIKA RUSSO EUROPEEN",304,"RUSSKO EVROPEÏSKAÏA LAÏKA"]
[null,"LAKELAND TERRIER",70,"LAKELAND TERRIER"]
[null,"LANDSEER",226,"LANDSEER - TYPE CONTINENTAL EUROPEEN"]
[null,"LAPPHUND SUEDOIS",135,"SVENSK LAPPHUND"]
[null,"LEVRIER AFGHAN",228,"AFGHAN HOUND"]
[null,"LEVRIER ECOSSAIS",164,"DEERHOUND - SCOTTISH DEERHOUND"]
[null,"LEVRIER ESPAGNOL",285,"GALGO ESPAÑOL"]
[null,"LEVRIER HONGROIS",240,"MAGYAR AGAR"]
[null,"LEVRIER IRLANDAIS",160,"IRISH WOLFHOUND"]
[null,"LEVRIER POLONAIS",333,"CHART POLSKI"]
[null,"LHASSA APSO",227,"LHASSA APSO"]
[null,"MALAMUTE DE L'ALASKA",243,"ALASKAN MALAMUTE"]
[null,"MANCHESTER TERRIER",71,"MANCHESTER TERRIER"]
[null,"MASTIFF",264,"MASTIFF"]
[null,"MATIN DE L'ALENTEJO",96,"RAFEIRO DO ALENTEJO"]
[null,"MATIN DES PYRENEES",92,"MASTIN DEL PIRINEO"]
[null,"MATIN ESPAGNOL",91,"MASTIN ESPANOL"]
[null,"MATIN NAPOLITAIN",197,"MASTINO NAPOLETANO"]
[null,"MUDI",238,"MUDI"]
[null,"NORFOLK TERRIER",272,"NORFOLK TERRIER"]
[null,"NORWICH TERRIER",72,"NORWICH TERRIER"]
[null,"PETIT BASSET GRIFFON VENDEEN",67,"PETIT BASSET GRIFFON VENDEEN"]
[null,"PETIT BLEU DE GASCOGNE",31,"PETIT BLEU DE GASCOGNE"]
[null,"PETIT BRABANCON",82,"PETIT BRABANCON"]
[null,"PETIT CHIEN COURANT SUISSE",60,"SCHWEIZERISCHER NIEDERLAUFHUND"]
[null,"PETIT CHIEN HOLLANDAIS DE CHASSE AU GIBIER D'EAU",314,"KOOIKERHONDJE"]
[null,"PETIT CHIEN LION",233,"PETIT CHIEN LION"]
[null,"PETIT CHIEN RUSSE",352,"RUSSKIY TOY"]
[null,"PETIT EPAGNEUL DE MUNSTER",102,"KLEINER MÜNSTERLÄNDER VORSTEHHUND"]
[null,"PETIT LEVRIER ITALIEN",200,"PICCOLO LEVRIERO ITALIANO"]
[null,"PINSCHER ALLEMAND",184,"DEUTSCHER PINSCHER"]
[null,"PINSCHER AUTRICHIEN",64,"ÖSTERREICHISCHER PINSCHER"]
[null,"PINSCHER NAIN",185,"ZWERGPINSCHER"]
[null,"PODENCO D'IBIZA",89,"PODENCO IBICENCO"]
[null,"POINTER ANGLAIS",1,"ENGLISH POINTER"]
[null,"POITEVIN",24,"POITEVIN"]
[null,"PORCELAINE",30,"PORCELAINE"]
[null,"PUDELPOINTER",216,"PUDELPOINTER"]
[null,"PULI",55,"PULI"]
[null,"PUMI",56,"PUMI"]
[null,"RATIER DE PRAGUE",917,"PRAZSKY KRYSARIK"]
[null,"RETRIEVER A POIL BOUCLE",110,"CURLY COATED RETRIEVER"]
[null,"RETRIEVER A POIL PLAT",121,"FLAT COATED RETRIEVER"]
[null,"RETRIEVER DE LA BAIE DE CHESAPEAKE",263,"CHESAPEAKE BAY RETRIEVER"]
[null,"RETRIEVER DE LA NOUVELLE ECOSSE",312,"NOVA SCOTIA DUCK TOLLING RETRIEVER"]
[null,"RETRIEVER DU LABRADOR",122,"LABRADOR RETRIEVER"]
[null,"ROTTWEILER",147,"ROTTWEILER"]
[null,"SAINT BERNARD",61,"ST. BERNHARDSHUND"]
[null,"SALUKI",269,"SALUKI"]
[null,"SAMOYEDE",212,"SAMOIEDSKAÏA SABAKA"]
[null,"SCHAPENDOES NEERLANDAIS",313,"NEDERLANDSE SCHAPENDOES"]
[null,"SCHIPPERKE",83,"SCHIPPERKE"]
[null,"SCHNAUZER",182,"SCHNAUZER"]
[null,"SCHNAUZER GEANT",181,"RIESENSCHNAUZER"]
[null,"SCHNAUZER NAIN",183,"ZWERGSCHNAUZER"]
[null,"SEALYHAM TERRIER",74,"SEALYHAM TERRIER"]
[null,"SETTER ANGLAIS",2,"ENGLISH SETTER"]
[null,"SETTER GORDON",6,"GORDON SETTER"]
[null,"SETTER IRLANDAIS ROUGE",120,"IRISH RED SETTER"]
[null,"SETTER IRLANDAIS ROUGE & BLANC",330,"IRISH RED AND WHITE SETTER"]
[null,"SHAR PEI",309,"SHAR PEI"]
[null,"SHIBA",257,"SHIBA"]
[null,"SHIH TZU",208,"SHIH TZU"]
[null,"SHIKOKU",319,"SHIKOKU"]
[null,"SKYE TERRIER",75,"SKYE TERRIER"]
[null,"SLOUGHI",188,"SLOUGHI"]
[null,"SMOUS DES PAYS BAS",308,"HOLLANDSE SMOUSHOND"]
[null,"SPINONE",165,"SPINONE ITALIANO"]
[null,"SPITZ",97,""]
[null,"SPITZ DE NORRBOTTEN",276,"NORRBOTTENSPETS"]
[null,"SPITZ DES VISIGOTHS",14,"VÄSTGÖTASPETS"]
[null,"SPITZ FINLANDAIS",49,"SUOMENPYSTYKORVA - FINNISH SPITZ"]
[null,"SPITZ JAPONAIS",262,"NIHON SUPITTSU"]
[null,"STAFFORDSHIRE BULL TERRIER",76,"STAFFORDSHIRE BULL TERRIER"]
[null,"STAFFORDSHIRE TERRIER AMERICAIN",286,"AMERICAN STAFFORDSHIRE TERRIER"]
[null,"SUSSEX SPANIEL",127,"SUSSEX SPANIEL"]
[null,"TCHOUVATCH SLOVAQUE",142,"SLOVENSKY CUVAC"]
[null,"TECKEL",148,"DACHSHUND - TECKEL"]
[null,"TERRE NEUVE",50,"NEWFOUNDLAND"]
[null,"TERRIER AUSTRALIEN",8,"AUSTRALIAN TERRIER"]
[null,"TERRIER AUSTRALIEN A POIL SOYEUX",236,"AUSTRALIAN SILKY TERRIER"]
[null,"TERRIER BRESILIEN",341,"TERRIER BRASILEIRO"]
[null,"TERRIER D'AGREMENT ANGLAIS NOIR ET FEU",13,"ENGLISH TOY TERRIER BLACK AND TAN"]
[null,"TERRIER DE BOSTON",140,"BOSTON TERRIER"]
[null,"TERRIER DE CHASSE ALLEMAND",103,"DEUTSCHER JAGDTERRIER"]
[null,"TERRIER DU REVEREND RUSSELL",339,"PARSON RUSSELL TERRIER"]
[null,"TERRIER ECOSSAIS",73,"SCOTTISH TERRIER"]
[null,"TERRIER IRLANDAIS",139,"IRISH TERRIER"]
[null,"TERRIER IRLANDAIS A POIL DOUX",40,"IRISH SOFT COATED WHEATEN TERRIER"]
[null,"TERRIER IRLANDAIS GLEN OF IMAAL",302,"IRISH GLEN OF IMAAL TERRIER"]
[null,"TERRIER JACK RUSSELL",345,"JACK RUSSELL TERRIER"]
[null,"TERRIER JAPONAIS",259,"NIHON TERIA"]
[null,"TERRIER KERRY BLUE",3,"KERRY BLUE TERRIER"]
[null,"TERRIER NOIR RUSSE",327,"TCHIORNY TERRIER"]
[null,"TERRIER TCHEQUE",246,"CESKY TERRIER"]
[null,"TERRIER TIBETAIN",209,"TIBETAN TERRIER"]
[null,"TOSA",260,"TOSA"]
[null,"VOLPINO ITALIEN",195,"VOLPINO ITALIANO"]
[null,"WELSH CORGI CARDIGAN",38,"WELSH CORGI CARDIGAN"]
[null,"WELSH CORGI PEMBROKE",39,"WELSH CORGI PEMBROKE"]
[null,"WELSH SPRINGER SPANIEL",126,"WELSH SPRINGER SPANIEL"]
[null,"WELSH TERRIER",78,"WELSH TERRIER"]
[null,"WEST HIGHLAND WHITE TERRIER",85,"WEST HIGHLAND WHITE TERRIER"]
[null,"WHIPPET",162,"WHIPPET"]
[null,"YORKSHIRE TERRIER",86,"YORKSHIRE TERRIER"]

{"sheet":"SCC","index":3,"n_rows":21,"n_cols":9,"rows_kept":21,"cut":false,"hidden":true,"merged":[]}
["DATE","ORGANISATEUR","Code Race FCI","LO","NUMERO","IDENTIFIANT","RESULTAT","NIVEAU","COMMENTAIRE"]
[{"$f":"Fiche_organisateur_N°1!$E$13","v":"00:00:00"},{"$f":"Fiche_organisateur_N°1!$E$15","v":0},{"$f":"Fiche_organisateur_N°2!H17","v":0},{"$f":"Fiche_organisateur_N°2!I17","v":0},{"$f":"Fiche_organisateur_N°2!J17","v":0},{"$f":"Fiche_organisateur_N°2!L17","v":0},{"$f":"'Rapport de Concours'!O17","v":"-"},"TS 1"]
[{"$f":"Fiche_organisateur_N°1!$E$13","v":"00:00:00"},{"$f":"Fiche_organisateur_N°1!$E$15","v":0},{"$f":"Fiche_organisateur_N°2!H18","v":0},{"$f":"Fiche_organisateur_N°2!I18","v":0},{"$f":"Fiche_organisateur_N°2!J18","v":0},{"$f":"Fiche_organisateur_N°2!L18","v":0},{"$f":"'Rapport de Concours'!O18","v":"-"},"TS 1"]
[{"$f":"Fiche_organisateur_N°1!$E$13","v":"00:00:00"},{"$f":"Fiche_organisateur_N°1!$E$15","v":0},{"$f":"Fiche_organisateur_N°2!H19","v":0},{"$f":"Fiche_organisateur_N°2!I19","v":0},{"$f":"Fiche_organisateur_N°2!J19","v":0},{"$f":"Fiche_organisateur_N°2!L19","v":0},{"$f":"'Rapport de Concours'!O19","v":"-"},"TS 1"]
[{"$f":"Fiche_organisateur_N°1!$E$13","v":"00:00:00"},{"$f":"Fiche_organisateur_N°1!$E$15","v":0},{"$f":"Fiche_organisateur_N°2!H20","v":0},{"$f":"Fiche_organisateur_N°2!I20","v":0},{"$f":"Fiche_organisateur_N°2!J20","v":0},{"$f":"Fiche_organisateur_N°2!L20","v":0},{"$f":"'Rapport de Concours'!O20","v":"-"},"TS 1"]
[{"$f":"Fiche_organisateur_N°1!$E$13","v":"00:00:00"},{"$f":"Fiche_organisateur_N°1!$E$15","v":0},{"$f":"Fiche_organisateur_N°2!H21","v":0},{"$f":"Fiche_organisateur_N°2!I21","v":0},{"$f":"Fiche_organisateur_N°2!J21","v":0},{"$f":"Fiche_organisateur_N°2!L21","v":0},{"$f":"'Rapport de Concours'!O21","v":"-"},"TS 1"]
[{"$f":"Fiche_organisateur_N°1!$E$13","v":"00:00:00"},{"$f":"Fiche_organisateur_N°1!$E$15","v":0},{"$f":"Fiche_organisateur_N°2!H22","v":0},{"$f":"Fiche_organisateur_N°2!I22","v":0},{"$f":"Fiche_organisateur_N°2!J22","v":0},{"$f":"Fiche_organisateur_N°2!L22","v":0},{"$f":"'Rapport de Concours'!O22","v":"-"},"TS 1"]
[{"$f":"Fiche_organisateur_N°1!$E$13","v":"00:00:00"},{"$f":"Fiche_organisateur_N°1!$E$15","v":0},{"$f":"Fiche_organisateur_N°2!H23","v":0},{"$f":"Fiche_organisateur_N°2!I23","v":0},{"$f":"Fiche_organisateur_N°2!J23","v":0},{"$f":"Fiche_organisateur_N°2!L23","v":0},{"$f":"'Rapport de Concours'!O23","v":"-"},"TS 1"]
[{"$f":"Fiche_organisateur_N°1!$E$13","v":"00:00:00"},{"$f":"Fiche_organisateur_N°1!$E$15","v":0},{"$f":"Fiche_organisateur_N°2!H24","v":0},{"$f":"Fiche_organisateur_N°2!I24","v":0},{"$f":"Fiche_organisateur_N°2!J24","v":0},{"$f":"Fiche_organisateur_N°2!L24","v":0},{"$f":"'Rapport de Concours'!O24","v":"-"},"TS 1"]
[{"$f":"Fiche_organisateur_N°1!$E$13","v":"00:00:00"},{"$f":"Fiche_organisateur_N°1!$E$15","v":0},{"$f":"Fiche_organisateur_N°2!H25","v":0},{"$f":"Fiche_organisateur_N°2!I25","v":0},{"$f":"Fiche_organisateur_N°2!J25","v":0},{"$f":"Fiche_organisateur_N°2!L25","v":0},{"$f":"'Rapport de Concours'!O25","v":"-"},"TS 1"]
[{"$f":"Fiche_organisateur_N°1!$E$13","v":"00:00:00"},{"$f":"Fiche_organisateur_N°1!$E$15","v":0},{"$f":"Fiche_organisateur_N°2!H26","v":0},{"$f":"Fiche_organisateur_N°2!I26","v":0},{"$f":"Fiche_organisateur_N°2!J26","v":0},{"$f":"Fiche_organisateur_N°2!L26","v":0},{"$f":"'Rapport de Concours'!O26","v":"-"},"TS 1"]
[{"$f":"Fiche_organisateur_N°1!$E$13","v":"00:00:00"},{"$f":"Fiche_organisateur_N°1!$E$15","v":0},{"$f":"Fiche_organisateur_N°2!H27","v":0},{"$f":"Fiche_organisateur_N°2!I27","v":0},{"$f":"Fiche_organisateur_N°2!J27","v":0},{"$f":"Fiche_organisateur_N°2!L27","v":0},{"$f":"'Rapport de Concours'!O27","v":"-"},"TS 1"]
[{"$f":"Fiche_organisateur_N°1!$E$13","v":"00:00:00"},{"$f":"Fiche_organisateur_N°1!$E$15","v":0},{"$f":"Fiche_organisateur_N°2!H28","v":0},{"$f":"Fiche_organisateur_N°2!I28","v":0},{"$f":"Fiche_organisateur_N°2!J28","v":0},{"$f":"Fiche_organisateur_N°2!L28","v":0},{"$f":"'Rapport de Concours'!O28","v":"-"},"TS 1"]
[{"$f":"Fiche_organisateur_N°1!$E$13","v":"00:00:00"},{"$f":"Fiche_organisateur_N°1!$E$15","v":0},{"$f":"Fiche_organisateur_N°2!H29","v":0},{"$f":"Fiche_organisateur_N°2!I29","v":0},{"$f":"Fiche_organisateur_N°2!J29","v":0},{"$f":"Fiche_organisateur_N°2!L29","v":0},{"$f":"'Rapport de Concours'!O29","v":"-"},"TS 1"]
[{"$f":"Fiche_organisateur_N°1!$E$13","v":"00:00:00"},{"$f":"Fiche_organisateur_N°1!$E$15","v":0},{"$f":"Fiche_organisateur_N°2!H30","v":0},{"$f":"Fiche_organisateur_N°2!I30","v":0},{"$f":"Fiche_organisateur_N°2!J30","v":0},{"$f":"Fiche_organisateur_N°2!L30","v":0},{"$f":"'Rapport de Concours'!O30","v":"-"},"TS 1"]
[{"$f":"Fiche_organisateur_N°1!$E$13","v":"00:00:00"},{"$f":"Fiche_organisateur_N°1!$E$15","v":0},{"$f":"Fiche_organisateur_N°2!H31","v":0},{"$f":"Fiche_organisateur_N°2!I31","v":0},{"$f":"Fiche_organisateur_N°2!J31","v":0},{"$f":"Fiche_organisateur_N°2!L31","v":0},{"$f":"'Rapport de Concours'!O31","v":"-"},"TS 1"]
[{"$f":"Fiche_organisateur_N°1!$E$13","v":"00:00:00"},{"$f":"Fiche_organisateur_N°1!$E$15","v":0},{"$f":"Fiche_organisateur_N°2!H32","v":0},{"$f":"Fiche_organisateur_N°2!I32","v":0},{"$f":"Fiche_organisateur_N°2!J32","v":0},{"$f":"Fiche_organisateur_N°2!L32","v":0},{"$f":"'Rapport de Concours'!O32","v":"-"},"TS 1"]
[{"$f":"Fiche_organisateur_N°1!$E$13","v":"00:00:00"},{"$f":"Fiche_organisateur_N°1!$E$15","v":0},{"$f":"Fiche_organisateur_N°2!H33","v":0},{"$f":"Fiche_organisateur_N°2!I33","v":0},{"$f":"Fiche_organisateur_N°2!J33","v":0},{"$f":"Fiche_organisateur_N°2!L33","v":0},{"$f":"'Rapport de Concours'!O33","v":"-"},"TS 1"]
[{"$f":"Fiche_organisateur_N°1!$E$13","v":"00:00:00"},{"$f":"Fiche_organisateur_N°1!$E$15","v":0},{"$f":"Fiche_organisateur_N°2!H34","v":0},{"$f":"Fiche_organisateur_N°2!I34","v":0},{"$f":"Fiche_organisateur_N°2!J34","v":0},{"$f":"Fiche_organisateur_N°2!L34","v":0},{"$f":"'Rapport de Concours'!O34","v":"-"},"TS 1"]
[{"$f":"Fiche_organisateur_N°1!$E$13","v":"00:00:00"},{"$f":"Fiche_organisateur_N°1!$E$15","v":0},{"$f":"Fiche_organisateur_N°2!H35","v":0},{"$f":"Fiche_organisateur_N°2!I35","v":0},{"$f":"Fiche_organisateur_N°2!J35","v":0},{"$f":"Fiche_organisateur_N°2!L35","v":0},{"$f":"'Rapport de Concours'!O35","v":"-"},"TS 1"]
[{"$f":"Fiche_organisateur_N°1!$E$13","v":"00:00:00"},{"$f":"Fiche_organisateur_N°1!$E$15","v":0},{"$f":"Fiche_organisateur_N°2!H36","v":0},{"$f":"Fiche_organisateur_N°2!I36","v":0},{"$f":"Fiche_organisateur_N°2!J36","v":0},{"$f":"Fiche_organisateur_N°2!L36","v":0},{"$f":"'Rapport de Concours'!O36","v":"-"},"TS 1"]

{"sheet":"Fiche_organisateur_N°2","index":4,"n_rows":45,"n_cols":20,"rows_kept":45,"cut":false,"hidden":false,"merged":[[13,1,13,12],[0,3,0,12],[1,3,1,12],[4,14,4,15],[7,10,7,11],[3,3,3,10]]}
[null,null,null,"COMMISSION D'UTILISATION TROUPEAUX"]
[null,null,null,"Président : Monsieur Jean Paul Kerihuel - 7, Allée Mme de La Fayette - 29 200 - ST RENAN"]
[]
[null,null,null,"Epreuve de travail sur Ovins - TRADITIONAL STYLE ",null,null,null,null,null,null,null,{"$f":"Fiche_organisateur_N°1!$E$26","v":"IHT 1"},null,null,null,null,null,null,null,"Secrétariat : vous pouvez faire vos remarques dans ce cadre"]
[null,null,null,null,"ORGANISATEUR",{"$f":"Fiche_organisateur_N°1!E15","v":0}]
[null,null,null,null,"Lieu",{"$f":"Fiche_organisateur_N°1!E16","v":0},null,null,null,null,null,null,null,null,null,null,null,null,null,"Note : sur cette feuille, vous pouvez ajuster les largeurs de colonnes…"]
[null,null,null,null,"Adresse du rassemblement",{"$f":"Fiche_organisateur_N°1!E24","v":0}]
[null,null,null,null,null,null,"Date du concours :",{"$f":"Fiche_organisateur_N°1!$E$13","v":0},null,null,{"$f":"IF(Fiche_organisateur_N°1!E13=\"\",\"-\",Fiche_organisateur_N°1!E13)","v":"-"}]
[null,null,null,null,"Contact",{"$f":"Fiche_organisateur_N°1!E18","v":0}]
[null,null,null,null,"Coordonnées du Contact",{"$f":"Fiche_organisateur_N°1!E19","v":0}]
[null,null,null,null,"Email",{"$f":"Fiche_organisateur_N°1!E20","v":0}]
[null,null,null,null,"Tel",{"$f":"Fiche_organisateur_N°1!E21","v":0}]
[]
[null,"Organisateur ==> Fiche  N°2"]
[]
[null,"N°","Propriétaires","Conducteurs","Noms des Chiens","Affixe","Races + Sexe","Code FCI","LO","Numéro LO","N° FAPAC","Identifiants","N° Carnet de Travail","Points","Qualificatifs","Classement"]
[null,1,null,null,null,null,null,null,null,null,null,null,null,{"$f":"'01'!E53","v":"-"},{"$f":"'01'!I53","v":"-"},{"$f":"IF(N17=\"-\",\"X\",IF(N17=0,\"N.C.\",_xlfn.RANK.EQ(N17,$N$17:$N$36,0)))","v":"X"}]
[null,2,null,null,null,null,null,null,null,null,null,null,null,{"$f":"'03'!E53","v":"-"},{"$f":"'03'!I53","v":"-"},"X"]
[null,3,null,null,null,null,null,null,null,null,null,null,null,{"$f":"'02'!E53","v":"-"},{"$f":"'02'!I53","v":"-"},"X"]
[null,4,null,null,null,null,null,null,null,null,null,null,null,{"$f":"'04'!E53","v":"-"},{"$f":"'04'!I53","v":"-"},"X"]
[null,5,null,null,null,null,null,null,null,null,null,null,null,{"$f":"'05'!E53","v":"-"},{"$f":"'05'!I53","v":"-"},"X"]
[null,6,null,null,null,null,null,null,null,null,null,null,null,{"$f":"'06'!E53","v":"-"},{"$f":"'06'!I53","v":"-"},"X"]
[null,7,null,null,null,null,null,null,null,null,null,null,null,{"$f":"'07'!E53","v":"-"},{"$f":"'07'!I53","v":"-"},"X"]
[null,8,null,null,null,null,null,null,null,null,null,null,null,{"$f":"'08'!E53","v":"-"},{"$f":"'08'!I53","v":"-"},"X"]
[null,9,null,null,null,null,null,null,null,null,null,null,null,{"$f":"'09'!E53","v":"-"},{"$f":"'09'!I53","v":"-"},"X"]
[null,10,null,null,null,null,null,null,null,null,null,null,null,{"$f":"'10'!E53","v":"-"},{"$f":"'10'!I53","v":"-"},"X"]
[null,11,null,null,null,null,null,null,null,null,null,null,null,{"$f":"'11'!E53","v":"-"},{"$f":"'11'!I53","v":"-"},"X"]
[null,12,null,null,null,null,null,null,null,null,null,null,null,{"$f":"'12'!E53","v":"-"},{"$f":"'12'!I53","v":"-"},"X"]
[null,13,null,null,null,null,null,null,null,null,null,null,null,{"$f":"'13'!E53","v":"-"},{"$f":"'13'!I53","v":"-"},"X"]
[null,14,null,null,null,null,null,null,null,null,null,null,null,{"$f":"'14'!E53","v":"-"},{"$f":"'14'!I53","v":"-"},"X"]
[null,15,null,null,null,null,null,null,null,null,null,null,null,{"$f":"'15'!E53","v":"-"},{"$f":"'15'!I53","v":"-"},"X"]
[null,16,null,null,null,null,null,null,null,null,null,null,null,{"$f":"'16'!E53","v":"-"},{"$f":"'16'!I53","v":"-"},"X"]
[null,17,null,null,null,null,null,null,null,null,null,null,null,{"$f":"'17'!E53","v":"-"},{"$f":"'17'!I53","v":"-"},"X"]
[null,18,null,null,null,null,null,null,null,null,null,null,null,{"$f":"'18'!E53","v":"-"},{"$f":"'18'!I53","v":"-"},"X"]
[null,19,null,null,null,null,null,null,null,null,null,null,null,{"$f":"'19'!E53","v":"-"},{"$f":"'19'!I53","v":"-"},"X"]
[null,20,null,null,null,null,null,null,null,null,null,null,null,{"$f":"'20'!E53","v":"-"},{"$f":"'20'!I53","v":"-"},"X"]
[]
[]
[null,null,null,"NE  PAS  UTILISER  CETTE  FICHE  COMME  RAPPORT  DE  CONCOURS  !",null,null,null,null,null,null,null,null,null,null,null,{"$f":"COUNTA(E17:E36)","v":0}]
[null,null,"Attention  !",null,null,null,null,null,null,null,null,null,null,null,"Nombre de chiens",{"$f":"COUNT(N17:N36)","v":0}]
[null,null,"IMPORTER  LES  DONNEES RECUPEREES  SUR  LE  SITE  DE  LA  C.C.  ( Attention, ne pas faire de COPIER - COLLER diectement vers votre fiche organisateur 2)",null,null,null,null,null,null,null,null,null,null,null,null,{"$f":"COUNT(N17:N36)-COUNTIF(N17:N36,\"=0\")","v":0}]
[null,null,null,"Vous devez  :  ","1 copier coller le fichier EXCEL /CC sur un fichier vierge (fichier tirage au sort) et  supprimer les lignes superflues"]
[null,null,null,null,"2 Faire précéder la colonne \"Noms des chiens\" des colonnes \"Propriétaires\" et \"Conducteurs\""]
[null,null,null,null,"3 Au tirage au sort, Classer les concurrents dasn l'ordre de passage"]
[null,null,null,null,"Enfin avant de commencer les épreuves, copie- coller le fichier tirage au sort, dans la fiche organisateur 2"]

{"sheet":"Rapport de Concours","index":5,"n_rows":46,"n_cols":19,"rows_kept":46,"cut":false,"hidden":false,"merged":[[43,1,43,14],[0,3,0,13],[1,3,1,11],[4,11,4,13],[13,1,13,13],[3,3,3,9]]}
[null,null,null,"COMMISSION D'UTILISATION TROUPEAUX"]
[null,null,null,"Président : Monsieur Jean Paul Kerihuel - 7, Allée Mme de La Fayette - 29 200 - ST RENAN"]
[]
[null,null,null,"Epreuve de travail sur Ovins - TRADITIONAL STYLE ",null,null,null,null,null,null,{"$f":"Fiche_organisateur_N°1!$E$26","v":"IHT 1"},null,null,null,null,null,null,null,"Secrétariat : vous pouvez faire vos remarques dans ce cadre"]
[null,null,null,null,null,null,"ORGANISATEUR",{"$f":"Fiche_organisateur_N°1!E15","v":0},null,null,"Date du concours :",{"$f":"IF(Fiche_organisateur_N°1!E13=\"\",\"-\",Fiche_organisateur_N°1!E13)","v":"-"}]
[null,null,null,null,null,null,"Lieu",{"$f":"Fiche_organisateur_N°1!E16","v":0},null,null,null,null,null,null,null,null,null,null,"Note : sur cette feuille, vous pouvez ajuster les largeurs de colonnes…"]
[null,null,null,null,null,null,"Adresse du rassemblement",{"$f":"Fiche_organisateur_N°1!E24","v":0}]
[]
[null,null,null,null,null,null,"Contact",{"$f":"Fiche_organisateur_N°1!E18","v":0}]
[null,null,null,null,null,null,"Coordonnées du Contact",{"$f":"Fiche_organisateur_N°1!E19","v":0}]
[null,null,null,null,null,null,"Email",{"$f":"Fiche_organisateur_N°1!E20","v":0}]
[null,null,null,null,null,null,"Tel",{"$f":"Fiche_organisateur_N°1!E21","v":0}]
[]
[null,"RAPPORT DE CONCOURS "]
[]
[null,null,"Propriétaires","Conducteurs","Noms des chiens","Affixes","Races + Sexe","N° FAPAC","Identifiants","N° Carnets de travail","Résultats","Qualif.1","Qualif.2","Classement"]
[null,{"$f":"IF(N17=\"X\",\"-\",N17)","v":"-"},{"$f":"Fiche_organisateur_N°2!C19","v":0},{"$f":"Fiche_organisateur_N°2!D19","v":0},{"$f":"Fiche_organisateur_N°2!E19","v":0},{"$f":"Fiche_organisateur_N°2!F19","v":0},{"$f":"Fiche_organisateur_N°2!G19","v":0},{"$f":"Fiche_organisateur_N°2!K19","v":0},{"$f":"Fiche_organisateur_N°2!L19","v":0},{"$f":"Fiche_organisateur_N°2!M19","v":0},{"$f":"'01'!E53","v":"-"},{"$f":"'01'!I53","v":"-"},{"$f":"'01'!E54","v":" -"},{"$f":"IF(K17=\"-\",\"X\",IF(K17=0,\"N.C.\",_xlfn.RANK.EQ(K17,$K$17:$K$36,0)))","v":"X"},{"$f":"IF(K17=\"-\",\"-\",IF(K17>=90,\"5\",IF(K17>=80,\"4\",IF(K17>=70,\"3\",IF(K17>=60,\"2\",IF(K17>0.01,\"1\",IF(K17=0,\"Eliminé\",\" - \")))))))","v":"-"}]
[null,"-",{"$f":"Fiche_organisateur_N°2!C17","v":0},{"$f":"Fiche_organisateur_N°2!D17","v":0},{"$f":"Fiche_organisateur_N°2!E17","v":0},{"$f":"Fiche_organisateur_N°2!F17","v":0},{"$f":"Fiche_organisateur_N°2!G17","v":0},{"$f":"Fiche_organisateur_N°2!K17","v":0},{"$f":"Fiche_organisateur_N°2!L17","v":0},{"$f":"Fiche_organisateur_N°2!M17","v":0},{"$f":"'02'!E53","v":"-"},{"$f":"'02'!I53","v":"-"},{"$f":"'02'!E54","v":" -"},"X","-"]
[null,"-",{"$f":"Fiche_organisateur_N°2!C18","v":0},{"$f":"Fiche_organisateur_N°2!D18","v":0},{"$f":"Fiche_organisateur_N°2!E18","v":0},{"$f":"Fiche_organisateur_N°2!F18","v":0},{"$f":"Fiche_organisateur_N°2!G18","v":0},{"$f":"Fiche_organisateur_N°2!K18","v":0},{"$f":"Fiche_organisateur_N°2!L18","v":0},{"$f":"Fiche_organisateur_N°2!M18","v":0},{"$f":"'03'!E53","v":"-"},{"$f":"'03'!I53","v":"-"},{"$f":"'03'!E54","v":" -"},"X","-"]
[null,"-",{"$f":"Fiche_organisateur_N°2!C20","v":0},{"$f":"Fiche_organisateur_N°2!D20","v":0},{"$f":"Fiche_organisateur_N°2!E20","v":0},{"$f":"Fiche_organisateur_N°2!F20","v":0},{"$f":"Fiche_organisateur_N°2!G20","v":0},{"$f":"Fiche_organisateur_N°2!K20","v":0},{"$f":"Fiche_organisateur_N°2!L20","v":0},{"$f":"Fiche_organisateur_N°2!M20","v":0},{"$f":"'04'!E53","v":"-"},{"$f":"'04'!I53","v":"-"},{"$f":"'04'!E54","v":" -"},"X","-"]
[null,"-",{"$f":"Fiche_organisateur_N°2!C21","v":0},{"$f":"Fiche_organisateur_N°2!D21","v":0},{"$f":"Fiche_organisateur_N°2!E21","v":0},{"$f":"Fiche_organisateur_N°2!F21","v":0},{"$f":"Fiche_organisateur_N°2!G21","v":0},{"$f":"Fiche_organisateur_N°2!K21","v":0},{"$f":"Fiche_organisateur_N°2!L21","v":0},{"$f":"Fiche_organisateur_N°2!M21","v":0},{"$f":"'05'!E53","v":"-"},{"$f":"'05'!I53","v":"-"},{"$f":"'05'!E54","v":" -"},"X","-"]
[null,"-",{"$f":"Fiche_organisateur_N°2!C22","v":0},{"$f":"Fiche_organisateur_N°2!D22","v":0},{"$f":"Fiche_organisateur_N°2!E22","v":0},{"$f":"Fiche_organisateur_N°2!F22","v":0},{"$f":"Fiche_organisateur_N°2!G22","v":0},{"$f":"Fiche_organisateur_N°2!K22","v":0},{"$f":"Fiche_organisateur_N°2!L22","v":0},{"$f":"Fiche_organisateur_N°2!M22","v":0},{"$f":"'06'!E53","v":"-"},{"$f":"'06'!I53","v":"-"},{"$f":"'06'!E54","v":" -"},"X","-"]
[null,"-",{"$f":"Fiche_organisateur_N°2!C23","v":0},{"$f":"Fiche_organisateur_N°2!D23","v":0},{"$f":"Fiche_organisateur_N°2!E23","v":0},{"$f":"Fiche_organisateur_N°2!F23","v":0},{"$f":"Fiche_organisateur_N°2!G23","v":0},{"$f":"Fiche_organisateur_N°2!K23","v":0},{"$f":"Fiche_organisateur_N°2!L23","v":0},{"$f":"Fiche_organisateur_N°2!M23","v":0},{"$f":"'07'!E53","v":"-"},{"$f":"'07'!I53","v":"-"},{"$f":"'07'!E54","v":" -"},"X","-"]
[null,"-",{"$f":"Fiche_organisateur_N°2!C24","v":0},{"$f":"Fiche_organisateur_N°2!D24","v":0},{"$f":"Fiche_organisateur_N°2!E24","v":0},{"$f":"Fiche_organisateur_N°2!F24","v":0},{"$f":"Fiche_organisateur_N°2!G24","v":0},{"$f":"Fiche_organisateur_N°2!K24","v":0},{"$f":"Fiche_organisateur_N°2!L24","v":0},{"$f":"Fiche_organisateur_N°2!M24","v":0},{"$f":"'08'!E53","v":"-"},{"$f":"'08'!I53","v":"-"},{"$f":"'08'!E54","v":" -"},"X","-"]
[null,"-",{"$f":"Fiche_organisateur_N°2!C25","v":0},{"$f":"Fiche_organisateur_N°2!D25","v":0},{"$f":"Fiche_organisateur_N°2!E25","v":0},{"$f":"Fiche_organisateur_N°2!F25","v":0},{"$f":"Fiche_organisateur_N°2!G25","v":0},{"$f":"Fiche_organisateur_N°2!K25","v":0},{"$f":"Fiche_organisateur_N°2!L25","v":0},{"$f":"Fiche_organisateur_N°2!M25","v":0},{"$f":"'09'!E53","v":"-"},{"$f":"'09'!I53","v":"-"},{"$f":"'09'!E54","v":" -"},"X","-"]
[null,"-",{"$f":"Fiche_organisateur_N°2!C26","v":0},{"$f":"Fiche_organisateur_N°2!D26","v":0},{"$f":"Fiche_organisateur_N°2!E26","v":0},{"$f":"Fiche_organisateur_N°2!F26","v":0},{"$f":"Fiche_organisateur_N°2!G26","v":0},{"$f":"Fiche_organisateur_N°2!K26","v":0},{"$f":"Fiche_organisateur_N°2!L26","v":0},{"$f":"Fiche_organisateur_N°2!M26","v":0},{"$f":"'10'!E53","v":"-"},{"$f":"'10'!I53","v":"-"},{"$f":"'10'!E54","v":" -"},"X","-"]
[null,"-",{"$f":"Fiche_organisateur_N°2!C27","v":0},{"$f":"Fiche_organisateur_N°2!D27","v":0},{"$f":"Fiche_organisateur_N°2!E27","v":0},{"$f":"Fiche_organisateur_N°2!F27","v":0},{"$f":"Fiche_organisateur_N°2!G27","v":0},{"$f":"Fiche_organisateur_N°2!K27","v":0},{"$f":"Fiche_organisateur_N°2!L27","v":0},{"$f":"Fiche_organisateur_N°2!M27","v":0},{"$f":"'11'!E53","v":"-"},{"$f":"'11'!I53","v":"-"},{"$f":"'11'!E54","v":" -"},"X","-"]
[null,"-",{"$f":"Fiche_organisateur_N°2!C28","v":0},{"$f":"Fiche_organisateur_N°2!D28","v":0},{"$f":"Fiche_organisateur_N°2!E28","v":0},{"$f":"Fiche_organisateur_N°2!F28","v":0},{"$f":"Fiche_organisateur_N°2!G28","v":0},{"$f":"Fiche_organisateur_N°2!K28","v":0},{"$f":"Fiche_organisateur_N°2!L28","v":0},{"$f":"Fiche_organisateur_N°2!M28","v":0},{"$f":"'12'!E53","v":"-"},{"$f":"'12'!I53","v":"-"},{"$f":"'12'!E54","v":" -"},"X","-"]
[null,"-",{"$f":"Fiche_organisateur_N°2!C29","v":0},{"$f":"Fiche_organisateur_N°2!D29","v":0},{"$f":"Fiche_organisateur_N°2!E29","v":0},{"$f":"Fiche_organisateur_N°2!F29","v":0},{"$f":"Fiche_organisateur_N°2!G29","v":0},{"$f":"Fiche_organisateur_N°2!K29","v":0},{"$f":"Fiche_organisateur_N°2!L29","v":0},{"$f":"Fiche_organisateur_N°2!M29","v":0},{"$f":"'13'!E53","v":"-"},{"$f":"'13'!I53","v":"-"},{"$f":"'13'!E54","v":" -"},"X","-"]
[null,"-",{"$f":"Fiche_organisateur_N°2!C30","v":0},{"$f":"Fiche_organisateur_N°2!D30","v":0},{"$f":"Fiche_organisateur_N°2!E30","v":0},{"$f":"Fiche_organisateur_N°2!F30","v":0},{"$f":"Fiche_organisateur_N°2!G30","v":0},{"$f":"Fiche_organisateur_N°2!K30","v":0},{"$f":"Fiche_organisateur_N°2!L30","v":0},{"$f":"Fiche_organisateur_N°2!M30","v":0},{"$f":"'14'!E53","v":"-"},{"$f":"'14'!I53","v":"-"},{"$f":"'14'!E54","v":" -"},"X","-"]
[null,"-",{"$f":"Fiche_organisateur_N°2!C31","v":0},{"$f":"Fiche_organisateur_N°2!D31","v":0},{"$f":"Fiche_organisateur_N°2!E31","v":0},{"$f":"Fiche_organisateur_N°2!F31","v":0},{"$f":"Fiche_organisateur_N°2!G31","v":0},{"$f":"Fiche_organisateur_N°2!K31","v":0},{"$f":"Fiche_organisateur_N°2!L31","v":0},{"$f":"Fiche_organisateur_N°2!M31","v":0},{"$f":"'15'!E53","v":"-"},{"$f":"'15'!I53","v":"-"},{"$f":"'15'!E54","v":" -"},"X","-"]
[null,"-",{"$f":"Fiche_organisateur_N°2!C32","v":0},{"$f":"Fiche_organisateur_N°2!D32","v":0},{"$f":"Fiche_organisateur_N°2!E32","v":0},{"$f":"Fiche_organisateur_N°2!F32","v":0},{"$f":"Fiche_organisateur_N°2!G32","v":0},{"$f":"Fiche_organisateur_N°2!K32","v":0},{"$f":"Fiche_organisateur_N°2!L32","v":0},{"$f":"Fiche_organisateur_N°2!M32","v":0},{"$f":"'16'!E53","v":"-"},{"$f":"'16'!I53","v":"-"},{"$f":"'16'!E54","v":" -"},"X","-"]
[null,"-",{"$f":"Fiche_organisateur_N°2!C33","v":0},{"$f":"Fiche_organisateur_N°2!D33","v":0},{"$f":"Fiche_organisateur_N°2!E33","v":0},{"$f":"Fiche_organisateur_N°2!F33","v":0},{"$f":"Fiche_organisateur_N°2!G33","v":0},{"$f":"Fiche_organisateur_N°2!K33","v":0},{"$f":"Fiche_organisateur_N°2!L33","v":0},{"$f":"Fiche_organisateur_N°2!M33","v":0},{"$f":"'17'!E53","v":"-"},{"$f":"'17'!I53","v":"-"},{"$f":"'17'!E54","v":" -"},"X","-"]
[null,"-",{"$f":"Fiche_organisateur_N°2!C34","v":0},{"$f":"Fiche_organisateur_N°2!D34","v":0},{"$f":"Fiche_organisateur_N°2!E34","v":0},{"$f":"Fiche_organisateur_N°2!F34","v":0},{"$f":"Fiche_organisateur_N°2!G34","v":0},{"$f":"Fiche_organisateur_N°2!K34","v":0},{"$f":"Fiche_organisateur_N°2!L34","v":0},{"$f":"Fiche_organisateur_N°2!M34","v":0},{"$f":"'18'!E53","v":"-"},{"$f":"'18'!I53","v":"-"},{"$f":"'17'!E54","v":" -"},"X","-"]
[null,"-",{"$f":"Fiche_organisateur_N°2!C35","v":0},{"$f":"Fiche_organisateur_N°2!D35","v":0},{"$f":"Fiche_organisateur_N°2!E35","v":0},{"$f":"Fiche_organisateur_N°2!F35","v":0},{"$f":"Fiche_organisateur_N°2!G35","v":0},{"$f":"Fiche_organisateur_N°2!K35","v":0},{"$f":"Fiche_organisateur_N°2!L35","v":0},{"$f":"Fiche_organisateur_N°2!M35","v":0},{"$f":"'19'!E53","v":"-"},{"$f":"'19'!I53","v":"-"},{"$f":"'19'!E54","v":" -"},"X","-"]
[null,"-",{"$f":"Fiche_organisateur_N°2!C36","v":0},{"$f":"Fiche_organisateur_N°2!D36","v":0},{"$f":"Fiche_organisateur_N°2!E36","v":0},{"$f":"Fiche_organisateur_N°2!F36","v":0},{"$f":"Fiche_organisateur_N°2!G36","v":0},{"$f":"Fiche_organisateur_N°2!K36","v":0},{"$f":"Fiche_organisateur_N°2!L36","v":0},{"$f":"Fiche_organisateur_N°2!M36","v":0},{"$f":"'20'!E53","v":"-"},{"$f":"'20'!I53","v":"-"},{"$f":"'20'!E54","v":" -"},"X","-"]
[]
[]
[null,null,null,{"$f":"COUNTA(Fiche_organisateur_N°2!E17:E36)","v":0},"(= inscrits)"]
[null,null,"Nombre de chiens",{"$f":"COUNT(K17:K36)","v":0},"(=entrés sur le terrain)",3,{"$f":"D40*F40","v":0}," <====  Montant de la redevance CC (chèque global à l'ordre de CC/ CUNTRP)  à joindre au présent rapport"]
[null,null,null,{"$f":"COUNT(K17:K36)-COUNTIF(K17:K36,\"=0\")","v":0},"(=ayant un score non nul)"]
[]
[]
[null,"Observations du Juge"]
[]
[null,null,null,null,null,null,null,"Le Juge :",{"$f":"Fiche_organisateur_N°1!E28","v":0},null,"Signature :"]

{"sheet":"00","index":6,"n_rows":56,"n_cols":22,"rows_kept":56,"cut":false,"hidden":false,"merged":[[15,1,15,11],[0,10,0,11],[2,1,2,11],[14,4,14,5],[14,7,14,11],[3,2,3,9],[22,1,22,11],[16,1,16,2],[16,3,21,3],[16,6,21,6],[16,7,16,8],[16,9,21,11],[17,1,17,2],[17,7,17,8],[18,1,18,2],[18,7,18,8],[19,1,19,2],[19,7,19,8],[20,1,20,2],[20,7,20,8],[21,1,21,2],[21,7,21,8],[23,1,23,2],[23,3,27,3],[23,6,27,6],[23,7,23,8],[23,9,27,11],[24,1,24,2],[24,7,24,8],[25,1,25,2],[25,7,25,8],[26,1,26,2],[26,7,26,8],[27,1,27,2],[27,7,27,8],[33,1,33,2],[33,7,33,8],[28,1,28,11],[29,1,29,2],[29,3,35,3],[29,6,35,6],[29,7,29,8],[29,9,35,11],[30,1,30,2],[30,7,30,8],[31,1,31,2],[31,7,31,8],[32,1,32,2],[32,7,32,8],[37,9,40,11],[34,1,34,2],[34,7,34,8],[35,1,35,2],[35,7,35,8],[36,1,36,11],[38,1,38,2],[38,7,38,8],[39,1,39,2],[39,7,39,8],[40,1,40,2],[40,7,40,8],[37,1,37,2],[37,3,40,3],[37,6,40,6],[37,7,37,8],[41,1,41,11],[42,1,42,2],[42,3,46,3],[42,6,46,6],[42,7,42,8],[42,9,46,11],[43,1,43,2],[43,7,43,8],[44,1,44,2],[44,7,44,8],[50,1,50,2],[50,7,50,11],[45,1,45,2],[45,7,45,8],[46,1,46,2],[46,7,46,8],[47,1,47,2],[47,3,49,3],[47,6,49,6],[47,7,47,8],[47,9,49,11],[48,1,48,2],[48,7,48,8],[49,1,49,2],[49,7,49,8],[51,7,51,9],[51,10,51,11],[52,4,52,5],[52,8,52,9],[53,4,53,11]]}
[null,null,null,null,null,null,null,null,null,null,{"$f":"Fiche_organisateur_N°1!$E$26","v":"IHT 1"}]
[]
[null,"COMMISSION D'UTILISATION TROUPEAUX"]
[null,null,"Epreuve de travail sur Ovins - TRADITIONAL STYLE ",null,null,null,null,null,null,null,null,null,null,null,null,null,null,"Secrétariat : vous pouvez faire vos remarques dans ce cadre"]
[null,"ORGANISATEUR :",{"$f":"Fiche_organisateur_N°1!E15","v":0}]
[null,"Lieu :",{"$f":"Fiche_organisateur_N°1!E16","v":0},null,null,null,null,"Date :",{"$f":"Fiche_organisateur_N°1!$E$13","v":0}]
[null,"Contact :",{"$f":"Fiche_organisateur_N°1!E18","v":0}]
[]
[]
[]
[]
[]
[]
[]
[null,"Epreuves                / 100 ",null,null,"Pointages",null,null,"Observations",null,null,null,null,null,null,null,null,null,null,null,"old formula"]
[null,null,null,null,null,null,null,null,null,null,null,null,null,null,null,null,null,"Exercices ","HWT","IHT1","IHT2","IHT3"]
[null,"Sortie de parc ou bergerie / Exit from the pen ",null,20,null,15,{"$f":"SUM(F17:F22)","v":20},{"$f":"IF(AND(B17=\"\",F17<>\"\")=1,\" => indiquer une épreuve ou ôter le pointage\",IF(AND(B17<>\"\",F17=\"\")=1,\" => indiquer un pointage ou ôter l'épreuve\",\"  OK\"))","v":"  OK"},null,{"$f":"IF(G17=D17,\"OK\",\"Grand total à revoir\")","v":"OK"},null,null,null,{"$f":"IF(H17=\"  OK\",1,0)","v":1},null,null,null,"Pen / Sortie du parc",15,15,10,5]
[null,null,null,null,null,null,null,"  OK",null,null,null,null,null,1,null,null,null,"Stop",15,10,10,10]
[null,null,null,null,null,null,null,"  OK",null,null,null,null,null,1,null,null,null,"Graze / Pâturage",20,20,15,10]
[null,null,null,null,null,null,null,"  OK",null,null,null,null,null,1,null,null,null,"Catch sheep /Prise",null,5,5,5]
[null,null,null,null,null,null,null,"  OK",null,null,null,null,null,1,null,null,null,"Vegetation/Conduite rive",null,null,5,5]
[null,"Rentrée du troupeau  / Re-pen",null,null,null,5,null,"  OK",null,null,null,null,null,1,null,null,null,"Traffic/ véhicule",null,null,null,5]
[null,null,null,null,null,null,null,null,null,null,null,null,null,null,null,null,null,"Re-pen / Rentrée au parc",5,5,5,5]
[null,"Pont/ Bridge",null,15,null,5,{"$f":"SUM(F24:F28)","v":15},{"$f":"IF(AND(B24=\"\",F24<>\"\")=1,\" => indiquer une épreuve ou ôter le pointage\",IF(AND(B24<>\"\",F24=\"\")=1,\" => indiquer un pointage ou ôter l'épreuve\",\"  OK\"))","v":"  OK"},null,{"$f":"IF(G24=D24,\"OK\",\"Grand total à revoir\")","v":"OK"},null,null,null,{"$f":"IF(H24=\"  OK\",1,0)","v":1}]
[null,"obstacle A",null,null,null,10,null,{"$f":"IF(AND(B25=\"\",F25<>\"\")=1,\" => indiquer une épreuve ou ôter le pointage\",IF(AND(B25<>\"\",F25=\"\")=1,\" => indiquer un pointage ou ôter l'épreuve\",\"  OK\"))","v":"  OK"},null,null,null,null,null,{"$f":"IF(H25=\"  OK\",1,0)","v":1},null,null,null,"Moving / Conduite du troupeau",30,20,20,20]
[null,"Qbstacle B",null,null,null,null,null,{"$f":"IF(AND(B26=\"\",F26<>\"\")=1,\" => indiquer une épreuve ou ôter le pointage\",IF(AND(B26<>\"\",F26=\"\")=1,\" => indiquer un pointage ou ôter l'épreuve\",\"  OK\"))","v":"  OK"},null,null,null,null,null,{"$f":"IF(H26=\"  OK\",1,0)","v":1},null,null,null,"Bridge / Pont",null,5,5,5]
[null,"Obstacle C",null,null,null,null,null,{"$f":"IF(AND(B27=\"\",F27<>\"\")=1,\" => indiquer une épreuve ou ôter le pointage\",IF(AND(B27<>\"\",F27=\"\")=1,\" => indiquer un pointage ou ôter l'épreuve\",\"  OK\"))","v":"  OK"},null,null,null,null,null,{"$f":"IF(H27=\"  OK\",1,0)","v":1},null,null,null,"Obstacle A",null,10,5,"-"]
[null,null,null,null,null,null,null,{"$f":"IF(AND(B28=\"\",F28<>\"\")=1,\" => indiquer une épreuve ou ôter le pointage\",IF(AND(B28<>\"\",F28=\"\")=1,\" => indiquer un pointage ou ôter l'épreuve\",\"  OK\"))","v":"  OK"},null,null,null,null,null,{"$f":"IF(H28=\"  OK\",1,0)","v":1},null,null,null,"Obstacle B",null,"-",10,10]
[null,null,null,null,null,null,null,null,null,null,null,null,null,null,null,null,null,"Obstacle C",null,"-","-",10]
[null,"Conduite /Moving",null,45,null,20,{"$f":"SUM(F30:F36)","v":45},{"$f":"IF(AND(B30=\"\",F30<>\"\")=1,\" => indiquer une épreuve ou ôter le pointage\",IF(AND(B30<>\"\",F30=\"\")=1,\" => indiquer un pointage ou ôter l'épreuve\",\"  OK\"))","v":"  OK"},null,{"$f":"IF(G30=D30,\"OK\",\"Grand total à revoir\")","v":"OK"},null,null,null,{"$f":"IF(H30=\"  OK\",1,0)","v":1},null,null,null,"Behaviour / Comportement",15,10,10,10]
[null,"Pâturage / Grazing",null,null,null,20,null,"  OK",null,null,null,null,null,1]
[null,"Prise de brebis/ catching sheep and holding a sheep ",null,null,null,5,null,"  OK",null,null,null,null,null,1]
[null,"Protection de cultures/ Crop protection ",null,null,null,null,null,"  OK",null,null,null,null,null,1]
[null,"Traffic/ Vehicule ",null,null,null,null,null,"  OK",null,null,null,null,null,1]
[null,null,null,null,null,null,null,"  OK",null,null,null,null,null,1]
[null,null,null,null,null,null,null,"  OK",null,null,null,null,null,1]
[]
[null,"Arrêt du troupeau / Stop 1",null,10,null,10,{"$f":"SUM(F38:F41)","v":10},{"$f":"IF(AND(B38=\"\",F38<>\"\")=1,\" => indiquer une épreuve ou ôter le pointage\",IF(AND(B38<>\"\",F38=\"\")=1,\" => indiquer un pointage ou ôter l'épreuve\",\"  OK\"))","v":"  OK"},null,{"$f":"IF(G38=D38,\"OK\",\"Grand total à revoir\")","v":"OK"},null,null,null,{"$f":"IF(H38=\"  OK\",1,0)","v":1}]
[null,"Arrêt du troupeau / Stop 2",null,null,null,null,null,{"$f":"IF(AND(B39=\"\",F39<>\"\")=1,\" => indiquer une épreuve ou ôter le pointage\",IF(AND(B39<>\"\",F39=\"\")=1,\" => indiquer un pointage ou ôter l'épreuve\",\"  OK\"))","v":"  OK"},null,null,null,null,null,{"$f":"IF(H39=\"  OK\",1,0)","v":1}]
[null,"Arrêt du troupeau / Stop 3",null,null,null,null,null,{"$f":"IF(AND(B40=\"\",F40<>\"\")=1,\" => indiquer une épreuve ou ôter le pointage\",IF(AND(B40<>\"\",F40=\"\")=1,\" => indiquer un pointage ou ôter l'épreuve\",\"  OK\"))","v":"  OK"},null,null,null,null,null,{"$f":"IF(H40=\"  OK\",1,0)","v":1}]
[null,null,null,null,null,null,null,{"$f":"IF(AND(B41=\"\",F41<>\"\")=1,\" => indiquer une épreuve ou ôter le pointage\",IF(AND(B41<>\"\",F41=\"\")=1,\" => indiquer un pointage ou ôter l'épreuve\",\"  OK\"))","v":"  OK"},null,null,null,null,null,{"$f":"IF(H41=\"  OK\",1,0)","v":1}]
[null,null,null,null,null,null,null,null,null,null,null,null,null,null,null,null,null,null,null," "]
[null,"Aptitude naturelle / Natural ability ",null,10,null,3,{"$f":"SUM(F43:F47)","v":10},{"$f":"IF(AND(B43=\"\",F43<>\"\")=1,\" => indiquer une épreuve ou ôter le pointage\",IF(AND(B43<>\"\",F43=\"\")=1,\" => indiquer un pointage ou ôter l'épreuve\",\"  OK\"))","v":"  OK"},null,{"$f":"IF(G43=D43,\"OK\",\"Grand total à revoir\")","v":"OK"},null,null,null,{"$f":"IF(H43=\"  OK\",1,0)","v":1}]
[null,"Absence d’agressivité/ gentleness ",null,null,null,2,null,"  OK",null,null,null,null,null,1]
[null,"Intelligence d’exécution/ Intelligence of execution  ",null,null,null,2,null,"  OK",null,null,null,null,null,1]
[null,"Obéissance / Obedience ",null,null,null,3,null,"  OK",null,null,null,null,null,1]
[null,null,null,null,null,null,null,"  OK",null,null,null,null,null,1]
[null,null,null,null,null,null,{"$f":"SUM(F48:F50)","v":0},"  OK",null,{"$f":"IF(G48=D48,\"OK\",\"Grand total à revoir\")","v":"OK"},null,null,null,1]
[null,null,null,null,null,null,null,"  OK",null,null,null,null,null,1]
[null,null,null,null,null,null,null,"  OK",null,null,null,null,null,1]
[null,"TOTAUX  =>   ",null,{"$f":"SUM(D17:D50)","v":100},{"$f":"SUM(E17:E50)","v":0},{"$f":"SUM(F17:F50)","v":100},null,{"$f":"IF(OR(F51<100,F51>100)=1,\"ATTENTION : TOTAL non égal à 100\",\"TOTAL = OK\")","v":"TOTAL = OK"},null,null,null,null,null,{"$f":"SUM(N17:N50)","v":30}]
[]
[]
[null,null,null,null,null,null,null,null,null,null,null,null,{"$f":"M51+M52","v":0}]
[]
[null,null,null,null,null,null,null,null,"Le juge",{"$f":"Fiche_organisateur_N°1!E28","v":0}]

{"sheet":"OLD","index":7,"n_rows":17,"n_cols":6,"rows_kept":17,"cut":false,"hidden":false,"merged":[]}
[]
[null,null,null,"old formula"]
[null,"Exercices ","HWT","IHT1","IHT2","IHT3"]
[null,"Pen / Sortie du parc",15,15,10,5]
[null,"Stop",15,10,10,10]
[null,"Graze / Pâturage",20,20,15,10]
[null,"Catch sheep /Prise",null,5,5,5]
[null,"Vegetation/Conduite rive",null,null,5,5]
[null,"Traffic/ véhicule",null,null,null,5]
[null,"Re-pen / Rentrée au parc",5,5,5,5]
[]
[null,"Moving / Conduite du troupeau",30,20,20,20]
[null,"Bridge / Pont",null,5,5,5]
[null,"Obstacle A",null,10,5,"-"]
[null,"Obstacle B",null,"-",10,10]
[null,"Obstacle C",null,"-","-",10]
[null,"Behaviour / Comportement",15,10,10,10]

{"sheet":"01","index":8,"n_rows":57,"n_cols":18,"rows_kept":57,"cut":false,"hidden":false,"merged":[[10,8,10,9],[0,10,0,11],[2,1,2,11],[8,8,8,9],[9,8,9,9],[3,2,3,9],[11,8,11,9],[14,4,14,5],[14,7,14,11],[15,1,15,11],[16,1,16,2],[16,3,21,3],[16,6,21,6],[16,7,16,11],[17,1,17,2],[17,7,17,11],[18,1,18,2],[18,7,18,11],[19,1,19,2],[19,7,19,11],[20,1,20,2],[20,7,20,11],[28,1,28,11],[21,1,21,2],[21,7,21,11],[22,1,22,11],[23,1,23,2],[23,3,27,3],[23,6,27,6],[23,7,23,11],[24,1,24,2],[24,7,24,11],[25,1,25,2],[25,7,25,11],[26,1,26,2],[26,7,26,11],[27,1,27,2],[27,7,27,11],[29,1,29,2],[29,3,35,3],[29,6,35,6],[29,7,29,11],[30,1,30,2],[30,7,30,11],[31,1,31,2],[31,7,31,11],[32,1,32,2],[32,7,32,11],[33,1,33,2],[33,7,33,11],[34,1,34,2],[34,7,34,11],[35,1,35,2],[35,7,35,11],[36,1,36,11],[37,1,37,2],[37,3,40,3],[37,6,40,6],[37,7,37,11],[38,1,38,2],[38,7,38,11],[39,1,39,2],[39,7,39,11],[40,1,40,2],[40,7,40,11],[41,1,41,11],[42,1,42,2],[42,3,46,3],[42,6,46,6],[42,7,42,11],[43,1,43,2],[43,7,43,11],[44,1,44,2],[44,7,44,11],[45,1,45,2],[45,7,45,11],[46,1,46,2],[46,7,46,11],[47,1,47,2],[47,3,49,3],[47,6,49,6],[47,7,47,11],[48,1,48,2],[48,7,48,11],[49,1,49,2],[49,7,49,11],[50,1,50,3],[50,9,50,11],[51,1,51,3],[51,7,51,9],[51,10,51,11],[54,1,54,11],[56,9,56,11],[52,1,52,3],[52,4,52,5],[53,1,53,3],[53,4,53,5],[53,7,53,9]]}
[null,null,null,null,null,null,null,null,null,null,{"$f":"Fiche_organisateur_N°1!$E$26","v":"IHT 1"}]
[]
[null,"COMMISSION D'UTILISATION TROUPEAUX"]
[null,null,"Epreuve de travail sur Ovins - TRADITIONAL STYLE "]
[null,"ORGANISATEUR :",{"$f":"Fiche_organisateur_N°1!E15","v":0}]
[null,"Lieu :",{"$f":"Fiche_organisateur_N°1!E16","v":0},null,null,null,null,"Date :",{"$f":"Fiche_organisateur_N°1!$E$13","v":0}]
[null,"Contact :",{"$f":"Fiche_organisateur_N°1!E18","v":0}]
[]
[null,"PROPRIETAIRE :",{"$f":"Fiche_organisateur_N°2!C17","v":0},null,null,null,null,"Race et sexe",{"$f":"Fiche_organisateur_N°2!G17","v":0}]
[null,"CONDUCTEUR :",{"$f":"Fiche_organisateur_N°2!D17","v":0},null,null,null,null,"N° FAPAC :",{"$f":"Fiche_organisateur_N°2!K17","v":0}]
[null,"NOM DU CHIEN :",{"$f":"Fiche_organisateur_N°2!E17","v":0},null,null,null,null,"AFFIXE :",{"$f":"Fiche_organisateur_N°2!F17","v":0}]
[null,null,null,null,null,null,null,"N° d'Identification",{"$f":"Fiche_organisateur_N°2!L17","v":0},null,null,null,null,"Contrôle de saisie (sur les onglets 01 à 20 )"]
[]
[null,null,null,null,null,null,null,null,null,null,null,null,null,"Ces colonnes n'apparaissent pas lors de l'impression…"]
[null,"Epreuves                ",null,null,"Pointages /100",null,null,{"$f":"IF(OR('00'!N51<>30,LEFT('00'!H51,9)=\"ATTENTION\")=1,\"NON VALIDE => corriger la feuille 00 ! ! !\",\"Observations\")","v":"Observations"},null,null,null,null,null,"contrôle-1",null,"contrôle-2"]
[null,{"$f":"IF('00'!B16=\"\",\" -\",'00'!B16)","v":" -"}]
[null,{"$f":"IF('00'!B17=\"\",\" -\",'00'!B17)","v":"Sortie de parc ou bergerie / Exit from the pen "},null,{"$f":"IF('00'!D17=\"\",\"\",'00'!D17)","v":20},null,{"$f":"IF('00'!F17=\"\",\"\",'00'!F17)","v":15},{"$f":"SUM(F17:F22)","v":20},null,null,null,null,null,null,{"$f":"IF(B17=\"\",\"\",IF(E17>F17,\"! ? !\",\"OK\"))","v":"OK"},null,{"$f":"IF(AND(B17=\" -\",E17<>0),\"! ? !\",\"OK\")","v":"OK"}]
[null,{"$f":"IF('00'!B18=\"\",\" -\",'00'!B18)","v":" -"},null,null,null,{"$f":"IF('00'!F18=\"\",\"\",'00'!F18)","v":""},null,null,null,null,null,null,null,"OK",null,"OK",null,"Contrôle-1 : Contrôle que les valeurs entrées ne sont pas supérieures"]
[null,{"$f":"IF('00'!B19=\"\",\" -\",'00'!B19)","v":" -"},null,null,null,{"$f":"IF('00'!F19=\"\",\"\",'00'!F19)","v":""},null,null,null,null,null,null,null,"OK",null,"OK",null,"                    aux pointages maxi attribués à chaque épreuve…"]
[null,{"$f":"IF('00'!B20=\"\",\" -\",'00'!B20)","v":" -"},null,null,null,{"$f":"IF('00'!F20=\"\",\"\",'00'!F20)","v":""},null,null,null,null,null,null,null,"OK",null,"OK"]
[null,{"$f":"IF('00'!B21=\"\",\" -\",'00'!B21)","v":" -"},null,null,null,{"$f":"IF('00'!F21=\"\",\"\",'00'!F21)","v":""},null,null,null,null,null,null,null,"OK",null,"OK"]
[null,{"$f":"IF('00'!B22=\"\",\" -\",'00'!B22)","v":"Rentrée du troupeau  / Re-pen"},null,null,null,{"$f":"IF('00'!F22=\"\",\"\",'00'!F22)","v":5},null,null,null,null,null,null,null,"OK",null,"OK"]
[null,{"$f":"IF('00'!B23=\"\",\" -\",'00'!B23)","v":" -"}]
[null,{"$f":"IF('00'!B24=\"\",\" -\",'00'!B24)","v":"Pont/ Bridge"},null,{"$f":"IF('00'!D24=\"\",\"\",'00'!D24)","v":15},null,{"$f":"IF('00'!F24=\"\",\"\",'00'!F24)","v":5},{"$f":"SUM(F24:F28)","v":15},null,null,null,null,null,null,{"$f":"IF(B24=\"\",\"\",IF(E24>F24,\"! ? !\",\"OK\"))","v":"OK"},null,{"$f":"IF(AND(B24=\" -\",E24<>0),\"! ? !\",\"OK\")","v":"OK"}]
[null,{"$f":"IF('00'!B25=\"\",\" -\",'00'!B25)","v":"obstacle A"},null,null,null,{"$f":"IF('00'!F25=\"\",\"\",'00'!F25)","v":10},null,null,null,null,null,null,null,{"$f":"IF(B25=\"\",\"\",IF(E25>F25,\"! ? !\",\"OK\"))","v":"OK"},null,{"$f":"IF(AND(B25=\" -\",E25<>0),\"! ? !\",\"OK\")","v":"OK"}]
[null,{"$f":"IF('00'!B26=\"\",\" -\",'00'!B26)","v":"Qbstacle B"},null,null,null,{"$f":"IF('00'!F26=\"\",\"\",'00'!F26)","v":""},null,null,null,null,null,null,null,{"$f":"IF(B26=\"\",\"\",IF(E26>F26,\"! ? !\",\"OK\"))","v":"OK"},null,{"$f":"IF(AND(B26=\" -\",E26<>0),\"! ? !\",\"OK\")","v":"OK"}]
[null,{"$f":"IF('00'!B27=\"\",\" -\",'00'!B27)","v":"Obstacle C"},null,null,null,{"$f":"IF('00'!F27=\"\",\"\",'00'!F27)","v":""},null,null,null,null,null,null,null,{"$f":"IF(B27=\"\",\"\",IF(E27>F27,\"! ? !\",\"OK\"))","v":"OK"},null,{"$f":"IF(AND(B27=\" -\",E27<>0),\"! ? !\",\"OK\")","v":"OK"}]
[null,{"$f":"IF('00'!B28=\"\",\" -\",'00'!B28)","v":" -"},null,null,null,{"$f":"IF('00'!F28=\"\",\"\",'00'!F28)","v":""},null,null,null,null,null,null,null,{"$f":"IF(B28=\"\",\"\",IF(E28>F28,\"! ? !\",\"OK\"))","v":"OK"},null,{"$f":"IF(AND(B28=\" -\",E28<>0),\"! ? !\",\"OK\")","v":"OK"}]
[null,{"$f":"IF('00'!B29=\"\",\" -\",'00'!B29)","v":" -"}]
[null,{"$f":"IF('00'!B30=\"\",\" -\",'00'!B30)","v":"Conduite /Moving"},null,{"$f":"IF('00'!D30=\"\",\"\",'00'!D30)","v":45},null,{"$f":"IF('00'!F30=\"\",\"\",'00'!F30)","v":20},{"$f":"SUM(F30:F36)","v":45},null,null,null,null,null,null,{"$f":"IF(B30=\"\",\"\",IF(E30>F30,\"! ? !\",\"OK\"))","v":"OK"},null,{"$f":"IF(AND(B30=\" -\",E30<>0),\"! ? !\",\"OK\")","v":"OK"},null,"Contrôle-2 : Contrôle que les lignes sans épreuve ne contiennent pas de note"]
[null,{"$f":"IF('00'!B31=\"\",\" -\",'00'!B31)","v":"Pâturage / Grazing"},null,null,null,{"$f":"IF('00'!F31=\"\",\"\",'00'!F31)","v":20},null,null,null,null,null,null,null,"OK",null,"OK"]
[null,{"$f":"IF('00'!B32=\"\",\" -\",'00'!B32)","v":"Prise de brebis/ catching sheep and holding a sheep "},null,null,null,{"$f":"IF('00'!F32=\"\",\"\",'00'!F32)","v":5},null,null,null,null,null,null,null,"OK",null,"OK"]
[null,{"$f":"IF('00'!B33=\"\",\" -\",'00'!B33)","v":"Protection de cultures/ Crop protection "},null,null,null,{"$f":"IF('00'!F33=\"\",\"\",'00'!F33)","v":""},null,null,null,null,null,null,null,"OK",null,"OK"]
[null,{"$f":"IF('00'!B34=\"\",\" -\",'00'!B34)","v":"Traffic/ Vehicule "},null,null,null,{"$f":"IF('00'!F34=\"\",\"\",'00'!F34)","v":""},null,null,null,null,null,null,null,"OK",null,"OK"]
[null,{"$f":"IF('00'!B35=\"\",\" -\",'00'!B35)","v":" -"},null,null,null,{"$f":"IF('00'!F35=\"\",\"\",'00'!F35)","v":""},null,null,null,null,null,null,null,"OK",null,"OK"]
[null,{"$f":"IF('00'!B36=\"\",\" -\",'00'!B36)","v":" -"},null,null,null,{"$f":"IF('00'!F36=\"\",\"\",'00'!F36)","v":""},null,null,null,null,null,null,null,"OK",null,"OK"]
[null,{"$f":"IF('00'!B37=\"\",\" -\",'00'!B37)","v":" -"}]
[null,{"$f":"IF('00'!B38=\"\",\" -\",'00'!B38)","v":"Arrêt du troupeau / Stop 1"},null,{"$f":"IF('00'!D38=\"\",\"\",'00'!D38)","v":10},null,{"$f":"IF('00'!F38=\"\",\"\",'00'!F38)","v":10},{"$f":"SUM(F38:F41)","v":10},null,null,null,null,null,null,{"$f":"IF(B38=\"\",\"\",IF(E38>F38,\"! ? !\",\"OK\"))","v":"OK"},null,{"$f":"IF(AND(B38=\" -\",E38<>0),\"! ? !\",\"OK\")","v":"OK"}]
[null,{"$f":"IF('00'!B39=\"\",\" -\",'00'!B39)","v":"Arrêt du troupeau / Stop 2"},null,null,null,{"$f":"IF('00'!F39=\"\",\"\",'00'!F39)","v":""},null,null,null,null,null,null,null,{"$f":"IF(B39=\"\",\"\",IF(E39>F39,\"! ? !\",\"OK\"))","v":"OK"},null,{"$f":"IF(AND(B39=\" -\",E39<>0),\"! ? !\",\"OK\")","v":"OK"}]
[null,{"$f":"IF('00'!B40=\"\",\" -\",'00'!B40)","v":"Arrêt du troupeau / Stop 3"},null,null,null,{"$f":"IF('00'!F40=\"\",\"\",'00'!F40)","v":""},null,null,null,null,null,null,null,{"$f":"IF(B40=\"\",\"\",IF(E40>F40,\"! ? !\",\"OK\"))","v":"OK"},null,{"$f":"IF(AND(B40=\" -\",E40<>0),\"! ? !\",\"OK\")","v":"OK"}]
[null,{"$f":"IF('00'!B41=\"\",\" -\",'00'!B41)","v":" -"},null,null,null,{"$f":"IF('00'!F41=\"\",\"\",'00'!F41)","v":""},null,null,null,null,null,null,null,{"$f":"IF(B41=\"\",\"\",IF(E41>F41,\"! ? !\",\"OK\"))","v":"OK"},null,{"$f":"IF(AND(B41=\" -\",E41<>0),\"! ? !\",\"OK\")","v":"OK"}]
[null,{"$f":"IF('00'!B42=\"\",\" -\",'00'!B42)","v":" -"}]
[null,{"$f":"IF('00'!B43=\"\",\" -\",'00'!B43)","v":"Aptitude naturelle / Natural ability "},null,{"$f":"IF('00'!D43=\"\",\"\",'00'!D43)","v":10},null,{"$f":"IF('00'!F43=\"\",\"\",'00'!F43)","v":3},{"$f":"SUM(F43:F47)","v":10},null,null,null,null,null,null,{"$f":"IF(B43=\"\",\"\",IF(E43>F43,\"! ? !\",\"OK\"))","v":"OK"},null,{"$f":"IF(AND(B43=\" -\",E43<>0),\"! ? !\",\"OK\")","v":"OK"}]
[null,{"$f":"IF('00'!B44=\"\",\" -\",'00'!B44)","v":"Absence d’agressivité/ gentleness "},null,null,null,{"$f":"IF('00'!F44=\"\",\"\",'00'!F44)","v":2},null,null,null,null,null,null,null,"OK",null,"OK"]
[null,{"$f":"IF('00'!B45=\"\",\" -\",'00'!B45)","v":"Intelligence d’exécution/ Intelligence of execution  "},null,null,null,{"$f":"IF('00'!F45=\"\",\"\",'00'!F45)","v":2},null,null,null,null,null,null,null,"OK",null,"OK"]
[null,{"$f":"IF('00'!B46=\"\",\" -\",'00'!B46)","v":"Obéissance / Obedience "},null,null,null,{"$f":"IF('00'!F46=\"\",\"\",'00'!F46)","v":3},null,null,null,null,null,null,null,"OK",null,"OK"]
[null,{"$f":"IF('00'!B47=\"\",\" -\",'00'!B47)","v":" -"},null,null,null,{"$f":"IF('00'!F47=\"\",\"\",'00'!F47)","v":""},null,null,null,null,null,null,null,"OK",null,"OK"]
[null,{"$f":"IF('00'!B48=\"\",\" -\",'00'!B48)","v":" -"},null,{"$f":"IF('00'!D48=\"\",\"\",'00'!D48)","v":""},null,{"$f":"IF('00'!F48=\"\",\"\",'00'!F48)","v":""},{"$f":"SUM(F48:F50)","v":0},null,null,null,null,null,null,"OK",null,"OK"]
[null,{"$f":"IF('00'!B49=\"\",\" -\",'00'!B49)","v":" -"},null,null,null,{"$f":"IF('00'!F49=\"\",\"\",'00'!F49)","v":""},null,null,null,null,null,null,null,"OK",null,"OK"," "]
[null,{"$f":"IF('00'!B50=\"\",\" -\",'00'!B50)","v":" -"},null,null,null,{"$f":"IF('00'!F50=\"\",\"\",'00'!F50)","v":""},null,null,null,null,null,null,null,"OK",null,"OK"]
[null,"Pointage du Travail  ==>  ",null,null,{"$f":"SUM(E17:E50)","v":0},{"$f":"SUM(F17:F50)","v":100},null,null,"Temps = "]
[null,"Pénalités Générales :\n(chiffre négatif)    .",null,null,null,null,null,"Informations sur les pénalités générales :\n   \n   \n   ",null,null,"Classement :",null,null,{"$f":"IF(E52=\"\",\"\",IF(E52>0,\"ATTENTION : 'Pénalité Générales' doit être un nombre négatif ! \",\"OK\"))","v":""}]
[null,"TOTAL GENERAL =",null,null,{"$f":"IF(COUNT(E17:E50)=0,\"-\",E51+E52)","v":"-"},null,null,"Qualificatif :",{"$f":"IF(E53=\"-\",\"-\",IF(E53>89.9999,\"EXCELLENT\",IF(E53>79.9999,\"TRES BON\",IF(E53>69.999,\"BON\",IF(E53>59.999,\"Satisfaisant\",IF(E53>0.1,\"insuffisant \",\"éliminé \"))))))","v":"-"},null,{"$f":"Fiche_organisateur_N°2!P17","v":"X"},{"$f":"'Rapport de Concours'!D40","v":0}]
[null,"CACIT IHT / RCACIT IHT / CACT IHT / RCACT IHT :",null,null," -",null,null," <== sur décision du juge "]
[null,"Observations :  ",null,null,null,null,null,null,null,null,null,null,{"$f":"M51+M52","v":0}]
[]
[null,null,null,null,null,null,null,null,"Le Juge :",{"$f":"Fiche_organisateur_N°1!E28","v":0}]

{"sheet":"02","index":9,"n_rows":57,"n_cols":18,"rows_kept":57,"cut":false,"hidden":false,"merged":[[10,8,10,9],[0,10,0,11],[2,1,2,11],[8,8,8,9],[9,8,9,9],[3,2,3,9],[11,8,11,9],[14,4,14,5],[14,7,14,11],[15,1,15,11],[16,1,16,2],[16,3,21,3],[16,6,21,6],[16,7,16,11],[17,1,17,2],[17,7,17,11],[18,1,18,2],[18,7,18,11],[19,1,19,2],[19,7,19,11],[20,1,20,2],[20,7,20,11],[28,1,28,11],[21,1,21,2],[21,7,21,11],[22,1,22,11],[23,1,23,2],[23,3,27,3],[23,6,27,6],[23,7,23,11],[24,1,24,2],[24,7,24,11],[25,1,25,2],[25,7,25,11],[26,1,26,2],[26,7,26,11],[27,1,27,2],[27,7,27,11],[29,1,29,2],[29,3,35,3],[29,6,35,6],[29,7,29,11],[30,1,30,2],[30,7,30,11],[31,1,31,2],[31,7,31,11],[32,1,32,2],[32,7,32,11],[33,1,33,2],[33,7,33,11],[34,1,34,2],[34,7,34,11],[35,1,35,2],[35,7,35,11],[36,1,36,11],[37,1,37,2],[37,3,40,3],[37,6,40,6],[37,7,37,11],[38,1,38,2],[38,7,38,11],[39,1,39,2],[39,7,39,11],[40,1,40,2],[40,7,40,11],[41,1,41,11],[42,1,42,2],[42,3,46,3],[42,6,46,6],[42,7,42,11],[43,1,43,2],[43,7,43,11],[44,1,44,2],[44,7,44,11],[45,1,45,2],[45,7,45,11],[46,1,46,2],[46,7,46,11],[47,1,47,2],[47,3,49,3],[47,6,49,6],[47,7,47,11],[48,1,48,2],[48,7,48,11],[49,1,49,2],[49,7,49,11],[50,1,50,3],[50,9,50,11],[51,1,51,3],[51,7,51,9],[51,10,51,11],[54,1,54,11],[56,9,56,11],[52,1,52,3],[52,4,52,5],[52,8,52,9],[53,1,53,3],[53,4,53,5],[53,7,53,9]]}
[null,null,null,null,null,null,null,null,null,null,{"$f":"Fiche_organisateur_N°1!$E$26","v":"IHT 1"}]
[]
[null,"COMMISSION D'UTILISATION TROUPEAUX"]
[null,null,"Epreuve de travail sur Ovins - TRADITIONAL STYLE "]
[null,"ORGANISATEUR :",{"$f":"Fiche_organisateur_N°1!E15","v":0}]
[null,"Lieu :",{"$f":"Fiche_organisateur_N°1!E16","v":0},null,null,null,null,"Date :",{"$f":"Fiche_organisateur_N°1!$E$13","v":0}]
[null,"Contact :",{"$f":"Fiche_organisateur_N°1!E18","v":0}]
[]
[null,"PROPRIETAIRE :",{"$f":"Fiche_organisateur_N°2!C19","v":0},null,null,null,null,"Race et sexe",{"$f":"Fiche_organisateur_N°2!G19","v":0}]
[null,"CONDUCTEUR :",{"$f":"Fiche_organisateur_N°2!D19","v":0},null,null,null,null,"N° FAPAC :",{"$f":"Fiche_organisateur_N°2!K19","v":0}]
[null,"NOM DU CHIEN :",{"$f":"Fiche_organisateur_N°2!E19","v":0},null,null,null,null,"AFFIXE :",{"$f":"Fiche_organisateur_N°2!F19","v":0}]
[null,null,null,null,null,null,null,"N° d'Identification",{"$f":"Fiche_organisateur_N°2!L19","v":0},null,null,null,null,"Contrôle de saisie (sur les onglets 01 à 20 )"]
[]
[null,null,null,null,null,null,null,null,null,null,null,null,null,"Ces colonnes n'apparaissent pas lors de l'impression…"]
[null,"Epreuves                ",null,null,"Pointages /100",null,null,{"$f":"IF(OR('00'!N51<>30,LEFT('00'!H51,9)=\"ATTENTION\")=1,\"NON VALIDE => corriger la feuille 00 ! ! !\",\"Observations\")","v":"Observations"},null,null,null,null,null,"contrôle-1",null,"contrôle-2"]
[null,{"$f":"IF('00'!B16=\"\",\" -\",'00'!B16)","v":" -"}]
[null,{"$f":"IF('00'!B17=\"\",\" -\",'00'!B17)","v":"Sortie de parc ou bergerie / Exit from the pen "},null,{"$f":"IF('00'!D17=\"\",\"\",'00'!D17)","v":20},null,{"$f":"IF('00'!F17=\"\",\"\",'00'!F17)","v":15},{"$f":"SUM(F17:F22)","v":20},null,null,null,null,null,null,{"$f":"IF(B17=\"\",\"\",IF(E17>F17,\"! ? !\",\"OK\"))","v":"OK"},null,{"$f":"IF(AND(B17=\" -\",E17<>0),\"! ? !\",\"OK\")","v":"OK"}]
[null,{"$f":"IF('00'!B18=\"\",\" -\",'00'!B18)","v":" -"},null,null,null,{"$f":"IF('00'!F18=\"\",\"\",'00'!F18)","v":""},null,null,null,null,null,null,null,"OK",null,"OK",null,"Contrôle-1 : Contrôle que les valeurs entrées ne sont pas supérieures"]
[null,{"$f":"IF('00'!B19=\"\",\" -\",'00'!B19)","v":" -"},null,null,null,{"$f":"IF('00'!F19=\"\",\"\",'00'!F19)","v":""},null,null,null,null,null,null,null,"OK",null,"OK",null,"                    aux pointages maxi attribués à chaque épreuve…"]
[null,{"$f":"IF('00'!B20=\"\",\" -\",'00'!B20)","v":" -"},null,null,null,{"$f":"IF('00'!F20=\"\",\"\",'00'!F20)","v":""},null,null,null,null,null,null,null,"OK",null,"OK"]
[null,{"$f":"IF('00'!B21=\"\",\" -\",'00'!B21)","v":" -"},null,null,null,{"$f":"IF('00'!F21=\"\",\"\",'00'!F21)","v":""},null,null,null,null,null,null,null,"OK",null,"OK"]
[null,{"$f":"IF('00'!B22=\"\",\" -\",'00'!B22)","v":"Rentrée du troupeau  / Re-pen"},null,null,null,{"$f":"IF('00'!F22=\"\",\"\",'00'!F22)","v":5},null,null,null,null,null,null,null,"OK",null,"OK"]
[null,{"$f":"IF('00'!B23=\"\",\" -\",'00'!B23)","v":" -"}]
[null,{"$f":"IF('00'!B24=\"\",\" -\",'00'!B24)","v":"Pont/ Bridge"},null,{"$f":"IF('00'!D24=\"\",\"\",'00'!D24)","v":15},null,{"$f":"IF('00'!F24=\"\",\"\",'00'!F24)","v":5},{"$f":"SUM(F24:F28)","v":15},null,null,null,null,null,null,{"$f":"IF(B24=\"\",\"\",IF(E24>F24,\"! ? !\",\"OK\"))","v":"OK"},null,{"$f":"IF(AND(B24=\" -\",E24<>0),\"! ? !\",\"OK\")","v":"OK"}]
[null,{"$f":"IF('00'!B25=\"\",\" -\",'00'!B25)","v":"obstacle A"},null,null,null,{"$f":"IF('00'!F25=\"\",\"\",'00'!F25)","v":10},null,null,null,null,null,null,null,{"$f":"IF(B25=\"\",\"\",IF(E25>F25,\"! ? !\",\"OK\"))","v":"OK"},null,{"$f":"IF(AND(B25=\" -\",E25<>0),\"! ? !\",\"OK\")","v":"OK"}]
[null,{"$f":"IF('00'!B26=\"\",\" -\",'00'!B26)","v":"Qbstacle B"},null,null,null,{"$f":"IF('00'!F26=\"\",\"\",'00'!F26)","v":""},null,null,null,null,null,null,null,{"$f":"IF(B26=\"\",\"\",IF(E26>F26,\"! ? !\",\"OK\"))","v":"OK"},null,{"$f":"IF(AND(B26=\" -\",E26<>0),\"! ? !\",\"OK\")","v":"OK"}]
[null,{"$f":"IF('00'!B27=\"\",\" -\",'00'!B27)","v":"Obstacle C"},null,null,null,{"$f":"IF('00'!F27=\"\",\"\",'00'!F27)","v":""},null,null,null,null,null,null,null,{"$f":"IF(B27=\"\",\"\",IF(E27>F27,\"! ? !\",\"OK\"))","v":"OK"},null,{"$f":"IF(AND(B27=\" -\",E27<>0),\"! ? !\",\"OK\")","v":"OK"}]
[null,{"$f":"IF('00'!B28=\"\",\" -\",'00'!B28)","v":" -"},null,null,null,{"$f":"IF('00'!F28=\"\",\"\",'00'!F28)","v":""},null,null,null,null,null,null,null,{"$f":"IF(B28=\"\",\"\",IF(E28>F28,\"! ? !\",\"OK\"))","v":"OK"},null,{"$f":"IF(AND(B28=\" -\",E28<>0),\"! ? !\",\"OK\")","v":"OK"}]
[null,{"$f":"IF('00'!B29=\"\",\" -\",'00'!B29)","v":" -"}]
[null,{"$f":"IF('00'!B30=\"\",\" -\",'00'!B30)","v":"Conduite /Moving"},null,{"$f":"IF('00'!D30=\"\",\"\",'00'!D30)","v":45},null,{"$f":"IF('00'!F30=\"\",\"\",'00'!F30)","v":20},{"$f":"SUM(F30:F36)","v":45},null,null,null,null,null,null,{"$f":"IF(B30=\"\",\"\",IF(E30>F30,\"! ? !\",\"OK\"))","v":"OK"},null,{"$f":"IF(AND(B30=\" -\",E30<>0),\"! ? !\",\"OK\")","v":"OK"},null,"Contrôle-2 : Contrôle que les lignes sans épreuve ne contiennent pas de note"]
[null,{"$f":"IF('00'!B31=\"\",\" -\",'00'!B31)","v":"Pâturage / Grazing"},null,null,null,{"$f":"IF('00'!F31=\"\",\"\",'00'!F31)","v":20},null,null,null,null,null,null,null,"OK",null,"OK"]
[null,{"$f":"IF('00'!B32=\"\",\" -\",'00'!B32)","v":"Prise de brebis/ catching sheep and holding a sheep "},null,null,null,{"$f":"IF('00'!F32=\"\",\"\",'00'!F32)","v":5},null,null,null,null,null,null,null,"OK",null,"OK"]
[null,{"$f":"IF('00'!B33=\"\",\" -\",'00'!B33)","v":"Protection de cultures/ Crop protection "},null,null,null,{"$f":"IF('00'!F33=\"\",\"\",'00'!F33)","v":""},null,null,null,null,null,null,null,"OK",null,"OK"]
[null,{"$f":"IF('00'!B34=\"\",\" -\",'00'!B34)","v":"Traffic/ Vehicule "},null,null,null,{"$f":"IF('00'!F34=\"\",\"\",'00'!F34)","v":""},null,null,null,null,null,null,null,"OK",null,"OK"]
[null,{"$f":"IF('00'!B35=\"\",\" -\",'00'!B35)","v":" -"},null,null,null,{"$f":"IF('00'!F35=\"\",\"\",'00'!F35)","v":""},null,null,null,null,null,null,null,"OK",null,"OK"]
[null,{"$f":"IF('00'!B36=\"\",\" -\",'00'!B36)","v":" -"},null,null,null,{"$f":"IF('00'!F36=\"\",\"\",'00'!F36)","v":""},null,null,null,null,null,null,null,"OK",null,"OK"]
[null,{"$f":"IF('00'!B37=\"\",\" -\",'00'!B37)","v":" -"}]
[null,{"$f":"IF('00'!B38=\"\",\" -\",'00'!B38)","v":"Arrêt du troupeau / Stop 1"},null,{"$f":"IF('00'!D38=\"\",\"\",'00'!D38)","v":10},null,{"$f":"IF('00'!F38=\"\",\"\",'00'!F38)","v":10},{"$f":"SUM(F38:F41)","v":10},null,null,null,null,null,null,{"$f":"IF(B38=\"\",\"\",IF(E38>F38,\"! ? !\",\"OK\"))","v":"OK"},null,{"$f":"IF(AND(B38=\" -\",E38<>0),\"! ? !\",\"OK\")","v":"OK"}]
[null,{"$f":"IF('00'!B39=\"\",\" -\",'00'!B39)","v":"Arrêt du troupeau / Stop 2"},null,null,null,{"$f":"IF('00'!F39=\"\",\"\",'00'!F39)","v":""},null,null,null,null,null,null,null,{"$f":"IF(B39=\"\",\"\",IF(E39>F39,\"! ? !\",\"OK\"))","v":"OK"},null,{"$f":"IF(AND(B39=\" -\",E39<>0),\"! ? !\",\"OK\")","v":"OK"}]
[null,{"$f":"IF('00'!B40=\"\",\" -\",'00'!B40)","v":"Arrêt du troupeau / Stop 3"},null,null,null,{"$f":"IF('00'!F40=\"\",\"\",'00'!F40)","v":""},null,null,null,null,null,null,null,{"$f":"IF(B40=\"\",\"\",IF(E40>F40,\"! ? !\",\"OK\"))","v":"OK"},null,{"$f":"IF(AND(B40=\" -\",E40<>0),\"! ? !\",\"OK\")","v":"OK"}]
[null,{"$f":"IF('00'!B41=\"\",\" -\",'00'!B41)","v":" -"},null,null,null,{"$f":"IF('00'!F41=\"\",\"\",'00'!F41)","v":""},null,null,null,null,null,null,null,{"$f":"IF(B41=\"\",\"\",IF(E41>F41,\"! ? !\",\"OK\"))","v":"OK"},null,{"$f":"IF(AND(B41=\" -\",E41<>0),\"! ? !\",\"OK\")","v":"OK"}]
[null,{"$f":"IF('00'!B42=\"\",\" -\",'00'!B42)","v":" -"}]
[null,{"$f":"IF('00'!B43=\"\",\" -\",'00'!B43)","v":"Aptitude naturelle / Natural ability "},null,{"$f":"IF('00'!D43=\"\",\"\",'00'!D43)","v":10},null,{"$f":"IF('00'!F43=\"\",\"\",'00'!F43)","v":3},{"$f":"SUM(F43:F47)","v":10},null,null,null,null,null,null,{"$f":"IF(B43=\"\",\"\",IF(E43>F43,\"! ? !\",\"OK\"))","v":"OK"},null,{"$f":"IF(AND(B43=\" -\",E43<>0),\"! ? !\",\"OK\")","v":"OK"}]
[null,{"$f":"IF('00'!B44=\"\",\" -\",'00'!B44)","v":"Absence d’agressivité/ gentleness "},null,null,null,{"$f":"IF('00'!F44=\"\",\"\",'00'!F44)","v":2},null,null,null,null,null,null,null,"OK",null,"OK"]
[null,{"$f":"IF('00'!B45=\"\",\" -\",'00'!B45)","v":"Intelligence d’exécution/ Intelligence of execution  "},null,null,null,{"$f":"IF('00'!F45=\"\",\"\",'00'!F45)","v":2},null,null,null,null,null,null,null,"OK",null,"OK"]
[null,{"$f":"IF('00'!B46=\"\",\" -\",'00'!B46)","v":"Obéissance / Obedience "},null,null,null,{"$f":"IF('00'!F46=\"\",\"\",'00'!F46)","v":3},null,null,null,null,null,null,null,"OK",null,"OK"]
[null,{"$f":"IF('00'!B47=\"\",\" -\",'00'!B47)","v":" -"},null,null,null,{"$f":"IF('00'!F47=\"\",\"\",'00'!F47)","v":""},null,null,null,null,null,null,null,"OK",null,"OK"]
[null,{"$f":"IF('00'!B48=\"\",\" -\",'00'!B48)","v":" -"},null,{"$f":"IF('00'!D48=\"\",\"\",'00'!D48)","v":""},null,{"$f":"IF('00'!F48=\"\",\"\",'00'!F48)","v":""},{"$f":"SUM(F48:F50)","v":0},null,null,null,null,null,null,"OK",null,"OK"]
[null,{"$f":"IF('00'!B49=\"\",\" -\",'00'!B49)","v":" -"},null,null,null,{"$f":"IF('00'!F49=\"\",\"\",'00'!F49)","v":""},null,null,null,null,null,null,null,"OK",null,"OK"," "]
[null,{"$f":"IF('00'!B50=\"\",\" -\",'00'!B50)","v":" -"},null,null,null,{"$f":"IF('00'!F50=\"\",\"\",'00'!F50)","v":""},null,null,null,null,null,null,null,"OK",null,"OK"]
[null,"Pointage du Travail  ==>  ",null,null,{"$f":"SUM(E17:E50)","v":0},{"$f":"SUM(F17:F50)","v":100},null,null,"Temps = "]
[null,"Pénalités Générales :\n(chiffre négatif)    .",null,null,null,null,null,"Informations sur les pénalités générales :\n   \n   \n   ",null,null,"Classement :",null,null,{"$f":"IF(E52=\"\",\"\",IF(E52>0,\"ATTENTION : 'Pénalité Générales' doit être un nombre négatif ! \",\"OK\"))","v":""}]
[null,"TOTAL GENERAL =",null,null,{"$f":"IF(COUNT(E17:E50)=0,\"-\",E51+E52)","v":"-"},null,null,"Qualificatif :",{"$f":"IF(E53=\"-\",\"-\",IF(E53>89.9999,\"EXCELLENT\",IF(E53>79.9999,\"TRES BON\",IF(E53>69.999,\"BON\",IF(E53>59.999,\"Satisfaisant\",IF(E53>0.1,\"insuffisant \",\"éliminé \"))))))","v":"-"},{"$f":"IF(F53=\"-\",\"-\",IF(F53>89.9999,\"EXCELLENT\",IF(F53>79.9999,\"TRES BON\",IF(F53>69.999,\"BON\",IF(F53>59.999,\"satisfaisant\",\" - \")))))","v":" - "},{"$f":"Fiche_organisateur_N°2!P19","v":"X"},{"$f":"'Rapport de Concours'!D40","v":0}]
[null,"CACITR / RCACITR / CACTR / RCACTR :",null,null," -",null,null," <== sur décision du juge "]
[null,"Observations :  ",null,null,null,null,null,null,null,null,null,null,{"$f":"M51+M52","v":0}]
[]
[null,null,null,null,null,null,null,null,"Le Juge :",{"$f":"Fiche_organisateur_N°1!E28","v":0}]

{"sheet":"03","index":10,"n_rows":57,"n_cols":18,"rows_kept":57,"cut":false,"hidden":false,"merged":[[10,8,10,9],[0,10,0,11],[2,1,2,11],[8,8,8,9],[9,8,9,9],[3,2,3,9],[11,8,11,9],[14,4,14,5],[14,7,14,11],[15,1,15,11],[16,1,16,2],[16,3,21,3],[16,6,21,6],[16,7,16,11],[17,1,17,2],[17,7,17,11],[18,1,18,2],[18,7,18,11],[19,1,19,2],[19,7,19,11],[20,1,20,2],[20,7,20,11],[28,1,28,11],[21,1,21,2],[21,7,21,11],[22,1,22,11],[23,1,23,2],[23,3,27,3],[23,6,27,6],[23,7,23,11],[24,1,24,2],[24,7,24,11],[25,1,25,2],[25,7,25,11],[26,1,26,2],[26,7,26,11],[27,1,27,2],[27,7,27,11],[29,1,29,2],[29,3,35,3],[29,6,35,6],[29,7,29,11],[30,1,30,2],[30,7,30,11],[31,1,31,2],[31,7,31,11],[32,1,32,2],[32,7,32,11],[33,1,33,2],[33,7,33,11],[34,1,34,2],[34,7,34,11],[35,1,35,2],[35,7,35,11],[36,1,36,11],[37,1,37,2],[37,3,40,3],[37,6,40,6],[37,7,37,11],[38,1,38,2],[38,7,38,11],[39,1,39,2],[39,7,39,11],[40,1,40,2],[40,7,40,11],[41,1,41,11],[42,1,42,2],[42,3,46,3],[42,6,46,6],[42,7,42,11],[43,1,43,2],[43,7,43,11],[44,1,44,2],[44,7,44,11],[45,1,45,2],[45,7,45,11],[46,1,46,2],[46,7,46,11],[47,1,47,2],[47,3,49,3],[47,6,49,6],[47,7,47,11],[48,1,48,2],[48,7,48,11],[49,1,49,2],[49,7,49,11],[50,1,50,3],[50,9,50,11],[51,1,51,3],[51,7,51,9],[51,10,51,11],[54,1,54,11],[56,9,56,11],[52,1,52,3],[52,4,52,5],[53,1,53,3],[53,4,53,5],[53,7,53,9]]}
[null,null,null,null,null,null,null,null,null,null,{"$f":"Fiche_organisateur_N°1!$E$26","v":"IHT 1"}]
[]
[null,"COMMISSION D'UTILISATION TROUPEAUX"]
[null,null,"Epreuve de travail sur Ovins - TRADITIONAL STYLE "]
[null,"ORGANISATEUR :",{"$f":"Fiche_organisateur_N°1!E15","v":0}]
[null,"Lieu :",{"$f":"Fiche_organisateur_N°1!E16","v":0},null,null,null,null,"Date :",{"$f":"Fiche_organisateur_N°1!$E$13","v":0}]
[null,"Contact :",{"$f":"Fiche_organisateur_N°1!E18","v":0}]
[]
[null,"PROPRIETAIRE :",{"$f":"Fiche_organisateur_N°2!C18","v":0},null,null,null,null,"Race et sexe",{"$f":"Fiche_organisateur_N°2!G18","v":0}]
[null,"CONDUCTEUR :",{"$f":"Fiche_organisateur_N°2!D18","v":0},null,null,null,null,"N° FAPAC :",{"$f":"Fiche_organisateur_N°2!K18","v":0}]
[null,"NOM DU CHIEN :",{"$f":"Fiche_organisateur_N°2!E18","v":0},null,null,null,null,"AFFIXE :",{"$f":"Fiche_organisateur_N°2!F18","v":0}]
[null,null,null,null,null,null,null,"N° d'Identification",{"$f":"Fiche_organisateur_N°2!L18","v":0},null,null,null,null,"Contrôle de saisie (sur les onglets 01 à 20 )"]
[]
[null,null,null,null,null,null,null,null,null,null,null,null,null,"Ces colonnes n'apparaissent pas lors de l'impression…"]
[null,"Epreuves                ",null,null,"Pointages /100",null,null,{"$f":"IF(OR('00'!N51<>30,LEFT('00'!H51,9)=\"ATTENTION\")=1,\"NON VALIDE => corriger la feuille 00 ! ! !\",\"Observations\")","v":"Observations"},null,null,null,null,null,"contrôle-1",null,"contrôle-2"]
[null,{"$f":"IF('00'!B16=\"\",\" -\",'00'!B16)","v":" -"}]
[null,{"$f":"IF('00'!B17=\"\",\" -\",'00'!B17)","v":"Sortie de parc ou bergerie / Exit from the pen "},null,{"$f":"IF('00'!D17=\"\",\"\",'00'!D17)","v":20},null,{"$f":"IF('00'!F17=\"\",\"\",'00'!F17)","v":15},{"$f":"SUM(F17:F22)","v":20},null,null,null,null,null,null,{"$f":"IF(B17=\"\",\"\",IF(E17>F17,\"! ? !\",\"OK\"))","v":"OK"},null,{"$f":"IF(AND(B17=\" -\",E17<>0),\"! ? !\",\"OK\")","v":"OK"}]
[null,{"$f":"IF('00'!B18=\"\",\" -\",'00'!B18)","v":" -"},null,null,null,{"$f":"IF('00'!F18=\"\",\"\",'00'!F18)","v":""},null,null,null,null,null,null,null,"OK",null,"OK",null,"Contrôle-1 : Contrôle que les valeurs entrées ne sont pas supérieures"]
[null,{"$f":"IF('00'!B19=\"\",\" -\",'00'!B19)","v":" -"},null,null,null,{"$f":"IF('00'!F19=\"\",\"\",'00'!F19)","v":""},null,null,null,null,null,null,null,"OK",null,"OK",null,"                    aux pointages maxi attribués à chaque épreuve…"]
[null,{"$f":"IF('00'!B20=\"\",\" -\",'00'!B20)","v":" -"},null,null,null,{"$f":"IF('00'!F20=\"\",\"\",'00'!F20)","v":""},null,null,null,null,null,null,null,"OK",null,"OK"]
[null,{"$f":"IF('00'!B21=\"\",\" -\",'00'!B21)","v":" -"},null,null,null,{"$f":"IF('00'!F21=\"\",\"\",'00'!F21)","v":""},null,null,null,null,null,null,null,"OK",null,"OK"]
[null,{"$f":"IF('00'!B22=\"\",\" -\",'00'!B22)","v":"Rentrée du troupeau  / Re-pen"},null,null,null,{"$f":"IF('00'!F22=\"\",\"\",'00'!F22)","v":5},null,null,null,null,null,null,null,"OK",null,"OK"]
[null,{"$f":"IF('00'!B23=\"\",\" -\",'00'!B23)","v":" -"}]
[null,{"$f":"IF('00'!B24=\"\",\" -\",'00'!B24)","v":"Pont/ Bridge"},null,{"$f":"IF('00'!D24=\"\",\"\",'00'!D24)","v":15},null,{"$f":"IF('00'!F24=\"\",\"\",'00'!F24)","v":5},{"$f":"SUM(F24:F28)","v":15},null,null,null,null,null,null,{"$f":"IF(B24=\"\",\"\",IF(E24>F24,\"! ? !\",\"OK\"))","v":"OK"},null,{"$f":"IF(AND(B24=\" -\",E24<>0),\"! ? !\",\"OK\")","v":"OK"}]
[null,{"$f":"IF('00'!B25=\"\",\" -\",'00'!B25)","v":"obstacle A"},null,null,null,{"$f":"IF('00'!F25=\"\",\"\",'00'!F25)","v":10},null,null,null,null,null,null,null,{"$f":"IF(B25=\"\",\"\",IF(E25>F25,\"! ? !\",\"OK\"))","v":"OK"},null,{"$f":"IF(AND(B25=\" -\",E25<>0),\"! ? !\",\"OK\")","v":"OK"}]
[null,{"$f":"IF('00'!B26=\"\",\" -\",'00'!B26)","v":"Qbstacle B"},null,null,null,{"$f":"IF('00'!F26=\"\",\"\",'00'!F26)","v":""},null,null,null,null,null,null,null,{"$f":"IF(B26=\"\",\"\",IF(E26>F26,\"! ? !\",\"OK\"))","v":"OK"},null,{"$f":"IF(AND(B26=\" -\",E26<>0),\"! ? !\",\"OK\")","v":"OK"}]
[null,{"$f":"IF('00'!B27=\"\",\" -\",'00'!B27)","v":"Obstacle C"},null,null,null,{"$f":"IF('00'!F27=\"\",\"\",'00'!F27)","v":""},null,null,null,null,null,null,null,{"$f":"IF(B27=\"\",\"\",IF(E27>F27,\"! ? !\",\"OK\"))","v":"OK"},null,{"$f":"IF(AND(B27=\" -\",E27<>0),\"! ? !\",\"OK\")","v":"OK"}]
[null,{"$f":"IF('00'!B28=\"\",\" -\",'00'!B28)","v":" -"},null,null,null,{"$f":"IF('00'!F28=\"\",\"\",'00'!F28)","v":""},null,null,null,null,null,null,null,{"$f":"IF(B28=\"\",\"\",IF(E28>F28,\"! ? !\",\"OK\"))","v":"OK"},null,{"$f":"IF(AND(B28=\" -\",E28<>0),\"! ? !\",\"OK\")","v":"OK"}]
[null,{"$f":"IF('00'!B29=\"\",\" -\",'00'!B29)","v":" -"}]
[null,{"$f":"IF('00'!B30=\"\",\" -\",'00'!B30)","v":"Conduite /Moving"},null,{"$f":"IF('00'!D30=\"\",\"\",'00'!D30)","v":45},null,{"$f":"IF('00'!F30=\"\",\"\",'00'!F30)","v":20},{"$f":"SUM(F30:F36)","v":45},null,null,null,null,null,null,{"$f":"IF(B30=\"\",\"\",IF(E30>F30,\"! ? !\",\"OK\"))","v":"OK"},null,{"$f":"IF(AND(B30=\" -\",E30<>0),\"! ? !\",\"OK\")","v":"OK"},null,"Contrôle-2 : Contrôle que les lignes sans épreuve ne contiennent pas de note"]
[null,{"$f":"IF('00'!B31=\"\",\" -\",'00'!B31)","v":"Pâturage / Grazing"},null,null,null,{"$f":"IF('00'!F31=\"\",\"\",'00'!F31)","v":20},null,null,null,null,null,null,null,"OK",null,"OK"]
[null,{"$f":"IF('00'!B32=\"\",\" -\",'00'!B32)","v":"Prise de brebis/ catching sheep and holding a sheep "},null,null,null,{"$f":"IF('00'!F32=\"\",\"\",'00'!F32)","v":5},null,null,null,null,null,null,null,"OK",null,"OK"]
[null,{"$f":"IF('00'!B33=\"\",\" -\",'00'!B33)","v":"Protection de cultures/ Crop protection "},null,null,null,{"$f":"IF('00'!F33=\"\",\"\",'00'!F33)","v":""},null,null,null,null,null,null,null,"OK",null,"OK"]
[null,{"$f":"IF('00'!B34=\"\",\" -\",'00'!B34)","v":"Traffic/ Vehicule "},null,null,null,{"$f":"IF('00'!F34=\"\",\"\",'00'!F34)","v":""},null,null,null,null,null,null,null,"OK",null,"OK"]
[null,{"$f":"IF('00'!B35=\"\",\" -\",'00'!B35)","v":" -"},null,null,null,{"$f":"IF('00'!F35=\"\",\"\",'00'!F35)","v":""},null,null,null,null,null,null,null,"OK",null,"OK"]
[null,{"$f":"IF('00'!B36=\"\",\" -\",'00'!B36)","v":" -"},null,null,null,{"$f":"IF('00'!F36=\"\",\"\",'00'!F36)","v":""},null,null,null,null,null,null,null,"OK",null,"OK"]
[null,{"$f":"IF('00'!B37=\"\",\" -\",'00'!B37)","v":" -"}]
[null,{"$f":"IF('00'!B38=\"\",\" -\",'00'!B38)","v":"Arrêt du troupeau / Stop 1"},null,{"$f":"IF('00'!D38=\"\",\"\",'00'!D38)","v":10},null,{"$f":"IF('00'!F38=\"\",\"\",'00'!F38)","v":10},{"$f":"SUM(F38:F41)","v":10},null,null,null,null,null,null,{"$f":"IF(B38=\"\",\"\",IF(E38>F38,\"! ? !\",\"OK\"))","v":"OK"},null,{"$f":"IF(AND(B38=\" -\",E38<>0),\"! ? !\",\"OK\")","v":"OK"}]
[null,{"$f":"IF('00'!B39=\"\",\" -\",'00'!B39)","v":"Arrêt du troupeau / Stop 2"},null,null,null,{"$f":"IF('00'!F39=\"\",\"\",'00'!F39)","v":""},null,null,null,null,null,null,null,{"$f":"IF(B39=\"\",\"\",IF(E39>F39,\"! ? !\",\"OK\"))","v":"OK"},null,{"$f":"IF(AND(B39=\" -\",E39<>0),\"! ? !\",\"OK\")","v":"OK"}]
[null,{"$f":"IF('00'!B40=\"\",\" -\",'00'!B40)","v":"Arrêt du troupeau / Stop 3"},null,null,null,{"$f":"IF('00'!F40=\"\",\"\",'00'!F40)","v":""},null,null,null,null,null,null,null,{"$f":"IF(B40=\"\",\"\",IF(E40>F40,\"! ? !\",\"OK\"))","v":"OK"},null,{"$f":"IF(AND(B40=\" -\",E40<>0),\"! ? !\",\"OK\")","v":"OK"}]
[null,{"$f":"IF('00'!B41=\"\",\" -\",'00'!B41)","v":" -"},null,null,null,{"$f":"IF('00'!F41=\"\",\"\",'00'!F41)","v":""},null,null,null,null,null,null,null,{"$f":"IF(B41=\"\",\"\",IF(E41>F41,\"! ? !\",\"OK\"))","v":"OK"},null,{"$f":"IF(AND(B41=\" -\",E41<>0),\"! ? !\",\"OK\")","v":"OK"}]
[null,{"$f":"IF('00'!B42=\"\",\" -\",'00'!B42)","v":" -"}]
[null,{"$f":"IF('00'!B43=\"\",\" -\",'00'!B43)","v":"Aptitude naturelle / Natural ability "},null,{"$f":"IF('00'!D43=\"\",\"\",'00'!D43)","v":10},null,{"$f":"IF('00'!F43=\"\",\"\",'00'!F43)","v":3},{"$f":"SUM(F43:F47)","v":10},null,null,null,null,null,null,{"$f":"IF(B43=\"\",\"\",IF(E43>F43,\"! ? !\",\"OK\"))","v":"OK"},null,{"$f":"IF(AND(B43=\" -\",E43<>0),\"! ? !\",\"OK\")","v":"OK"}]
[null,{"$f":"IF('00'!B44=\"\",\" -\",'00'!B44)","v":"Absence d’agressivité/ gentleness "},null,null,null,{"$f":"IF('00'!F44=\"\",\"\",'00'!F44)","v":2},null,null,null,null,null,null,null,"OK",null,"OK"]
[null,{"$f":"IF('00'!B45=\"\",\" -\",'00'!B45)","v":"Intelligence d’exécution/ Intelligence of execution  "},null,null,null,{"$f":"IF('00'!F45=\"\",\"\",'00'!F45)","v":2},null,null,null,null,null,null,null,"OK",null,"OK"]
[null,{"$f":"IF('00'!B46=\"\",\" -\",'00'!B46)","v":"Obéissance / Obedience "},null,null,null,{"$f":"IF('00'!F46=\"\",\"\",'00'!F46)","v":3},null,null,null,null,null,null,null,"OK",null,"OK"]
[null,{"$f":"IF('00'!B47=\"\",\" -\",'00'!B47)","v":" -"},null,null,null,{"$f":"IF('00'!F47=\"\",\"\",'00'!F47)","v":""},null,null,null,null,null,null,null,"OK",null,"OK"]
[null,{"$f":"IF('00'!B48=\"\",\" -\",'00'!B48)","v":" -"},null,{"$f":"IF('00'!D48=\"\",\"\",'00'!D48)","v":""},null,{"$f":"IF('00'!F48=\"\",\"\",'00'!F48)","v":""},{"$f":"SUM(F48:F50)","v":0},null,null,null,null,null,null,"OK",null,"OK"]
[null,{"$f":"IF('00'!B49=\"\",\" -\",'00'!B49)","v":" -"},null,null,null,{"$f":"IF('00'!F49=\"\",\"\",'00'!F49)","v":""},null,null,null,null,null,null,null,"OK",null,"OK"," "]
[null,{"$f":"IF('00'!B50=\"\",\" -\",'00'!B50)","v":" -"},null,null,null,{"$f":"IF('00'!F50=\"\",\"\",'00'!F50)","v":""},null,null,null,null,null,null,null,"OK",null,"OK"]
[null,"Pointage du Travail  ==>  ",null,null,{"$f":"SUM(E17:E50)","v":0},{"$f":"SUM(F17:F50)","v":100},null,null,"Temps = "]
[null,"Pénalités Générales :\n(chiffre négatif)    .",null,null,null,null,null,"Informations sur les pénalités générales :\n   \n   \n   ",null,null,"Classement :",null,null,{"$f":"IF(E52=\"\",\"\",IF(E52>0,\"ATTENTION : 'Pénalité Générales' doit être un nombre négatif ! \",\"OK\"))","v":""}]
[null,"TOTAL GENERAL =",null,null,{"$f":"IF(COUNT(E17:E50)=0,\"-\",E51+E52)","v":"-"},null,null,"Qualificatif :",{"$f":"IF(E53=\"-\",\"-\",IF(E53>89.9999,\"EXCELLENT\",IF(E53>79.9999,\"TRES BON\",IF(E53>69.999,\"BON\",IF(E53>59.999,\"Satisfaisant\",IF(E53>0.1,\"insuffisant \",\"éliminé \"))))))","v":"-"},{"$f":"IF(F53=\"-\",\"-\",IF(F53>89.9999,\"EXCELLENT\",IF(F53>79.9999,\"TRES BON\",IF(F53>69.999,\"BON\",IF(F53>59.999,\"satisfaisant\",\" - \")))))","v":" - "},{"$f":"Fiche_organisateur_N°2!P18","v":"X"},{"$f":"'Rapport de Concours'!D40","v":0}]
[null,"CACITR / RCACITR / CACTR / RCACTR :",null,null," -",null,null," <== sur décision du juge "]
[null,"Observations :  ",null,null,null,null,null,null,null,null,null,null,{"$f":"M51+M52","v":0}]
[]
[null,null,null,null,null,null,null,null,"Le Juge :",{"$f":"Fiche_organisateur_N°1!E28","v":0}]

{"sheet":"04","index":11,"n_rows":57,"n_cols":18,"rows_kept":57,"cut":false,"hidden":false,"merged":[[10,8,10,9],[0,10,0,11],[2,1,2,11],[8,8,8,9],[9,8,9,9],[3,2,3,9],[11,8,11,9],[14,4,14,5],[14,7,14,11],[15,1,15,11],[16,1,16,2],[16,3,21,3],[16,6,21,6],[16,7,16,11],[17,1,17,2],[17,7,17,11],[18,1,18,2],[18,7,18,11],[19,1,19,2],[19,7,19,11],[20,1,20,2],[20,7,20,11],[28,1,28,11],[21,1,21,2],[21,7,21,11],[22,1,22,11],[23,1,23,2],[23,3,27,3],[23,6,27,6],[23,7,23,11],[24,1,24,2],[24,7,24,11],[25,1,25,2],[25,7,25,11],[26,1,26,2],[26,7,26,11],[27,1,27,2],[27,7,27,11],[29,1,29,2],[29,3,35,3],[29,6,35,6],[29,7,29,11],[30,1,30,2],[30,7,30,11],[31,1,31,2],[31,7,31,11],[32,1,32,2],[32,7,32,11],[33,1,33,2],[33,7,33,11],[34,1,34,2],[34,7,34,11],[35,1,35,2],[35,7,35,11],[36,1,36,11],[37,1,37,2],[37,3,40,3],[37,6,40,6],[37,7,37,11],[38,1,38,2],[38,7,38,11],[39,1,39,2],[39,7,39,11],[40,1,40,2],[40,7,40,11],[41,1,41,11],[42,1,42,2],[42,3,46,3],[42,6,46,6],[42,7,42,11],[43,1,43,2],[43,7,43,11],[44,1,44,2],[44,7,44,11],[45,1,45,2],[45,7,45,11],[46,1,46,2],[46,7,46,11],[47,1,47,2],[47,3,49,3],[47,6,49,6],[47,7,47,11],[48,1,48,2],[48,7,48,11],[49,1,49,2],[49,7,49,11],[50,1,50,3],[50,9,50,11],[51,1,51,3],[51,7,51,9],[51,10,51,11],[54,1,54,11],[56,9,56,11],[52,1,52,3],[52,4,52,5],[52,8,52,9],[53,1,53,3],[53,4,53,5],[53,7,53,9]]}
[null,null,null,null,null,null,null,null,null,null,{"$f":"Fiche_organisateur_N°1!$E$26","v":"IHT 1"}]
[]
[null,"COMMISSION D'UTILISATION TROUPEAUX"]
[null,null,"Epreuve de travail sur Ovins - TRADITIONAL STYLE "]
[null,"ORGANISATEUR :",{"$f":"Fiche_organisateur_N°1!E15","v":0}]
[null,"Lieu :",{"$f":"Fiche_organisateur_N°1!E16","v":0},null,null,null,null,"Date :",{"$f":"Fiche_organisateur_N°1!$E$13","v":0}]
[null,"Contact :",{"$f":"Fiche_organisateur_N°1!E18","v":0}]
[]
[null,"PROPRIETAIRE :",{"$f":"Fiche_organisateur_N°2!C20","v":0},null,null,null,null,"Race et sexe",{"$f":"Fiche_organisateur_N°2!G20","v":0}]
[null,"CONDUCTEUR :",{"$f":"Fiche_organisateur_N°2!D20","v":0},null,null,null,null,"N° FAPAC :",{"$f":"Fiche_organisateur_N°2!K20","v":0}]
[null,"NOM DU CHIEN :",{"$f":"Fiche_organisateur_N°2!E20","v":0},null,null,null,null,"AFFIXE :",{"$f":"Fiche_organisateur_N°2!F20","v":0}]
[null,null,null,null,null,null,null,"N° d'Identification",{"$f":"Fiche_organisateur_N°2!L20","v":0},null,null,null,null,"Contrôle de saisie (sur les onglets 01 à 20 )"]
[]
[null,null,null,null,null,null,null,null,null,null,null,null,null,"Ces colonnes n'apparaissent pas lors de l'impression…"]
[null,"Epreuves                ",null,null,"Pointages /100",null,null,{"$f":"IF(OR('00'!N51<>30,LEFT('00'!H51,9)=\"ATTENTION\")=1,\"NON VALIDE => corriger la feuille 00 ! ! !\",\"Observations\")","v":"Observations"},null,null,null,null,null,"contrôle-1",null,"contrôle-2"]
[null,{"$f":"IF('00'!B16=\"\",\" -\",'00'!B16)","v":" -"}]
[null,{"$f":"IF('00'!B17=\"\",\" -\",'00'!B17)","v":"Sortie de parc ou bergerie / Exit from the pen "},null,{"$f":"IF('00'!D17=\"\",\"\",'00'!D17)","v":20},null,{"$f":"IF('00'!F17=\"\",\"\",'00'!F17)","v":15},{"$f":"SUM(F17:F22)","v":20},null,null,null,null,null,null,{"$f":"IF(B17=\"\",\"\",IF(E17>F17,\"! ? !\",\"OK\"))","v":"OK"},null,{"$f":"IF(AND(B17=\" -\",E17<>0),\"! ? !\",\"OK\")","v":"OK"}]
[null,{"$f":"IF('00'!B18=\"\",\" -\",'00'!B18)","v":" -"},null,null,null,{"$f":"IF('00'!F18=\"\",\"\",'00'!F18)","v":""},null,null,null,null,null,null,null,"OK",null,"OK",null,"Contrôle-1 : Contrôle que les valeurs entrées ne sont pas supérieures"]
[null,{"$f":"IF('00'!B19=\"\",\" -\",'00'!B19)","v":" -"},null,null,null,{"$f":"IF('00'!F19=\"\",\"\",'00'!F19)","v":""},null,null,null,null,null,null,null,"OK",null,"OK",null,"                    aux pointages maxi attribués à chaque épreuve…"]
[null,{"$f":"IF('00'!B20=\"\",\" -\",'00'!B20)","v":" -"},null,null,null,{"$f":"IF('00'!F20=\"\",\"\",'00'!F20)","v":""},null,null,null,null,null,null,null,"OK",null,"OK"]
[null,{"$f":"IF('00'!B21=\"\",\" -\",'00'!B21)","v":" -"},null,null,null,{"$f":"IF('00'!F21=\"\",\"\",'00'!F21)","v":""},null,null,null,null,null,null,null,"OK",null,"OK"]
[null,{"$f":"IF('00'!B22=\"\",\" -\",'00'!B22)","v":"Rentrée du troupeau  / Re-pen"},null,null,null,{"$f":"IF('00'!F22=\"\",\"\",'00'!F22)","v":5},null,null,null,null,null,null,null,"OK",null,"OK"]
[null,{"$f":"IF('00'!B23=\"\",\" -\",'00'!B23)","v":" -"}]
[null,{"$f":"IF('00'!B24=\"\",\" -\",'00'!B24)","v":"Pont/ Bridge"},null,{"$f":"IF('00'!D24=\"\",\"\",'00'!D24)","v":15},null,{"$f":"IF('00'!F24=\"\",\"\",'00'!F24)","v":5},{"$f":"SUM(F24:F28)","v":15},null,null,null,null,null,null,{"$f":"IF(B24=\"\",\"\",IF(E24>F24,\"! ? !\",\"OK\"))","v":"OK"},null,{"$f":"IF(AND(B24=\" -\",E24<>0),\"! ? !\",\"OK\")","v":"OK"}]
[null,{"$f":"IF('00'!B25=\"\",\" -\",'00'!B25)","v":"obstacle A"},null,null,null,{"$f":"IF('00'!F25=\"\",\"\",'00'!F25)","v":10},null,null,null,null,null,null,null,{"$f":"IF(B25=\"\",\"\",IF(E25>F25,\"! ? !\",\"OK\"))","v":"OK"},null,{"$f":"IF(AND(B25=\" -\",E25<>0),\"! ? !\",\"OK\")","v":"OK"}]
[null,{"$f":"IF('00'!B26=\"\",\" -\",'00'!B26)","v":"Qbstacle B"},null,null,null,{"$f":"IF('00'!F26=\"\",\"\",'00'!F26)","v":""},null,null,null,null,null,null,null,{"$f":"IF(B26=\"\",\"\",IF(E26>F26,\"! ? !\",\"OK\"))","v":"OK"},null,{"$f":"IF(AND(B26=\" -\",E26<>0),\"! ? !\",\"OK\")","v":"OK"}]
[null,{"$f":"IF('00'!B27=\"\",\" -\",'00'!B27)","v":"Obstacle C"},null,null,null,{"$f":"IF('00'!F27=\"\",\"\",'00'!F27)","v":""},null,null,null,null,null,null,null,{"$f":"IF(B27=\"\",\"\",IF(E27>F27,\"! ? !\",\"OK\"))","v":"OK"},null,{"$f":"IF(AND(B27=\" -\",E27<>0),\"! ? !\",\"OK\")","v":"OK"}]
[null,{"$f":"IF('00'!B28=\"\",\" -\",'00'!B28)","v":" -"},null,null,null,{"$f":"IF('00'!F28=\"\",\"\",'00'!F28)","v":""},null,null,null,null,null,null,null,{"$f":"IF(B28=\"\",\"\",IF(E28>F28,\"! ? !\",\"OK\"))","v":"OK"},null,{"$f":"IF(AND(B28=\" -\",E28<>0),\"! ? !\",\"OK\")","v":"OK"}]
[null,{"$f":"IF('00'!B29=\"\",\" -\",'00'!B29)","v":" -"}]
[null,{"$f":"IF('00'!B30=\"\",\" -\",'00'!B30)","v":"Conduite /Moving"},null,{"$f":"IF('00'!D30=\"\",\"\",'00'!D30)","v":45},null,{"$f":"IF('00'!F30=\"\",\"\",'00'!F30)","v":20},{"$f":"SUM(F30:F36)","v":45},null,null,null,null,null,null,{"$f":"IF(B30=\"\",\"\",IF(E30>F30,\"! ? !\",\"OK\"))","v":"OK"},null,{"$f":"IF(AND(B30=\" -\",E30<>0),\"! ? !\",\"OK\")","v":"OK"},null,"Contrôle-2 : Contrôle que les lignes sans épreuve ne contiennent pas de note"]
[null,{"$f":"IF('00'!B31=\"\",\" -\",'00'!B31)","v":"Pâturage / Grazing"},null,null,null,{"$f":"IF('00'!F31=\"\",\"\",'00'!F31)","v":20},null,null,null,null,null,null,null,"OK",null,"OK"]
[null,{"$f":"IF('00'!B32=\"\",\" -\",'00'!B32)","v":"Prise de brebis/ catching sheep and holding a sheep "},null,null,null,{"$f":"IF('00'!F32=\"\",\"\",'00'!F32)","v":5},null,null,null,null,null,null,null,"OK",null,"OK"]
[null,{"$f":"IF('00'!B33=\"\",\" -\",'00'!B33)","v":"Protection de cultures/ Crop protection "},null,null,null,{"$f":"IF('00'!F33=\"\",\"\",'00'!F33)","v":""},null,null,null,null,null,null,null,"OK",null,"OK"]
[null,{"$f":"IF('00'!B34=\"\",\" -\",'00'!B34)","v":"Traffic/ Vehicule "},null,null,null,{"$f":"IF('00'!F34=\"\",\"\",'00'!F34)","v":""},null,null,null,null,null,null,null,"OK",null,"OK"]
[null,{"$f":"IF('00'!B35=\"\",\" -\",'00'!B35)","v":" -"},null,null,null,{"$f":"IF('00'!F35=\"\",\"\",'00'!F35)","v":""},null,null,null,null,null,null,null,"OK",null,"OK"]
[null,{"$f":"IF('00'!B36=\"\",\" -\",'00'!B36)","v":" -"},null,null,null,{"$f":"IF('00'!F36=\"\",\"\",'00'!F36)","v":""},null,null,null,null,null,null,null,"OK",null,"OK"]
[null,{"$f":"IF('00'!B37=\"\",\" -\",'00'!B37)","v":" -"}]
[null,{"$f":"IF('00'!B38=\"\",\" -\",'00'!B38)","v":"Arrêt du troupeau / Stop 1"},null,{"$f":"IF('00'!D38=\"\",\"\",'00'!D38)","v":10},null,{"$f":"IF('00'!F38=\"\",\"\",'00'!F38)","v":10},{"$f":"SUM(F38:F41)","v":10},null,null,null,null,null,null,{"$f":"IF(B38=\"\",\"\",IF(E38>F38,\"! ? !\",\"OK\"))","v":"OK"},null,{"$f":"IF(AND(B38=\" -\",E38<>0),\"! ? !\",\"OK\")","v":"OK"}]
[null,{"$f":"IF('00'!B39=\"\",\" -\",'00'!B39)","v":"Arrêt du troupeau / Stop 2"},null,null,null,{"$f":"IF('00'!F39=\"\",\"\",'00'!F39)","v":""},null,null,null,null,null,null,null,{"$f":"IF(B39=\"\",\"\",IF(E39>F39,\"! ? !\",\"OK\"))","v":"OK"},null,{"$f":"IF(AND(B39=\" -\",E39<>0),\"! ? !\",\"OK\")","v":"OK"}]
[null,{"$f":"IF('00'!B40=\"\",\" -\",'00'!B40)","v":"Arrêt du troupeau / Stop 3"},null,null,null,{"$f":"IF('00'!F40=\"\",\"\",'00'!F40)","v":""},null,null,null,null,null,null,null,{"$f":"IF(B40=\"\",\"\",IF(E40>F40,\"! ? !\",\"OK\"))","v":"OK"},null,{"$f":"IF(AND(B40=\" -\",E40<>0),\"! ? !\",\"OK\")","v":"OK"}]
[null,{"$f":"IF('00'!B41=\"\",\" -\",'00'!B41)","v":" -"},null,null,null,{"$f":"IF('00'!F41=\"\",\"\",'00'!F41)","v":""},null,null,null,null,null,null,null,{"$f":"IF(B41=\"\",\"\",IF(E41>F41,\"! ? !\",\"OK\"))","v":"OK"},null,{"$f":"IF(AND(B41=\" -\",E41<>0),\"! ? !\",\"OK\")","v":"OK"}]
[null,{"$f":"IF('00'!B42=\"\",\" -\",'00'!B42)","v":" -"}]
[null,{"$f":"IF('00'!B43=\"\",\" -\",'00'!B43)","v":"Aptitude naturelle / Natural ability "},null,{"$f":"IF('00'!D43=\"\",\"\",'00'!D43)","v":10},null,{"$f":"IF('00'!F43=\"\",\"\",'00'!F43)","v":3},{"$f":"SUM(F43:F47)","v":10},null,null,null,null,null,null,{"$f":"IF(B43=\"\",\"\",IF(E43>F43,\"! ? !\",\"OK\"))","v":"OK"},null,{"$f":"IF(AND(B43=\" -\",E43<>0),\"! ? !\",\"OK\")","v":"OK"}]
[null,{"$f":"IF('00'!B44=\"\",\" -\",'00'!B44)","v":"Absence d’agressivité/ gentleness "},null,null,null,{"$f":"IF('00'!F44=\"\",\"\",'00'!F44)","v":2},null,null,null,null,null,null,null,"OK",null,"OK"]
[null,{"$f":"IF('00'!B45=\"\",\" -\",'00'!B45)","v":"Intelligence d’exécution/ Intelligence of execution  "},null,null,null,{"$f":"IF('00'!F45=\"\",\"\",'00'!F45)","v":2},null,null,null,null,null,null,null,"OK",null,"OK"]
[null,{"$f":"IF('00'!B46=\"\",\" -\",'00'!B46)","v":"Obéissance / Obedience "},null,null,null,{"$f":"IF('00'!F46=\"\",\"\",'00'!F46)","v":3},null,null,null,null,null,null,null,"OK",null,"OK"]
[null,{"$f":"IF('00'!B47=\"\",\" -\",'00'!B47)","v":" -"},null,null,null,{"$f":"IF('00'!F47=\"\",\"\",'00'!F47)","v":""},null,null,null,null,null,null,null,"OK",null,"OK"]
[null,{"$f":"IF('00'!B48=\"\",\" -\",'00'!B48)","v":" -"},null,{"$f":"IF('00'!D48=\"\",\"\",'00'!D48)","v":""},null,{"$f":"IF('00'!F48=\"\",\"\",'00'!F48)","v":""},{"$f":"SUM(F48:F50)","v":0},null,null,null,null,null,null,"OK",null,"OK"]
[null,{"$f":"IF('00'!B49=\"\",\" -\",'00'!B49)","v":" -"},null,null,null,{"$f":"IF('00'!F49=\"\",\"\",'00'!F49)","v":""},null,null,null,null,null,null,null,"OK",null,"OK"," "]
[null,{"$f":"IF('00'!B50=\"\",\" -\",'00'!B50)","v":" -"},null,null,null,{"$f":"IF('00'!F50=\"\",\"\",'00'!F50)","v":""},null,null,null,null,null,null,null,"OK",null,"OK"]
[null,"Pointage du Travail  ==>  ",null,null,{"$f":"SUM(E17:E50)","v":0},{"$f":"SUM(F17:F50)","v":100},null,null,"Temps = "]
[null,"Pénalités Générales :\n(chiffre négatif)    .",null,null,null,null,null,"Informations sur les pénalités générales :\n   \n   \n   ",null,null,"Classement :",null,null,{"$f":"IF(E52=\"\",\"\",IF(E52>0,\"ATTENTION : 'Pénalité Générales' doit être un nombre négatif ! \",\"OK\"))","v":""}]
[null,"TOTAL GENERAL =",null,null,{"$f":"IF(COUNT(E17:E50)=0,\"-\",E51+E52)","v":"-"},null,null,"Qualificatif :",{"$f":"IF(E53=\"-\",\"-\",IF(E53>89.9999,\"EXCELLENT\",IF(E53>79.9999,\"TRES BON\",IF(E53>69.999,\"BON\",IF(E53>59.999,\"Satisfaisant\",IF(E53>0.1,\"insuffisant \",\"éliminé \"))))))","v":"-"},{"$f":"IF(F53=\"-\",\"-\",IF(F53>89.9999,\"EXCELLENT\",IF(F53>79.9999,\"TRES BON\",IF(F53>69.999,\"BON\",IF(F53>59.999,\"satisfaisant\",\" - \")))))","v":" - "},{"$f":"Fiche_organisateur_N°2!P20","v":"X"},{"$f":"'Rapport de Concours'!D40","v":0}]
[null,"CACITR / RCACITR / CACTR / RCACTR :",null,null," -",null,null," <== sur décision du juge "]
[null,"Observations :  ",null,null,null,null,null,null,null,null,null,null,{"$f":"M51+M52","v":0}]
[]
[null,null,null,null,null,null,null,null,"Le Juge :",{"$f":"Fiche_organisateur_N°1!E28","v":0}]

{"sheet":"05","index":12,"n_rows":57,"n_cols":18,"rows_kept":57,"cut":false,"hidden":false,"merged":[[10,8,10,9],[0,10,0,11],[2,1,2,11],[8,8,8,9],[9,8,9,9],[3,2,3,9],[11,8,11,9],[14,4,14,5],[14,7,14,11],[15,1,15,11],[16,1,16,2],[16,3,21,3],[16,6,21,6],[16,7,16,11],[17,1,17,2],[17,7,17,11],[18,1,18,2],[18,7,18,11],[19,1,19,2],[19,7,19,11],[20,1,20,2],[20,7,20,11],[28,1,28,11],[21,1,21,2],[21,7,21,11],[22,1,22,11],[23,1,23,2],[23,3,27,3],[23,6,27,6],[23,7,23,11],[24,1,24,2],[24,7,24,11],[25,1,25,2],[25,7,25,11],[26,1,26,2],[26,7,26,11],[27,1,27,2],[27,7,27,11],[29,1,29,2],[29,3,35,3],[29,6,35,6],[29,7,29,11],[30,1,30,2],[30,7,30,11],[31,1,31,2],[31,7,31,11],[32,1,32,2],[32,7,32,11],[33,1,33,2],[33,7,33,11],[34,1,34,2],[34,7,34,11],[35,1,35,2],[35,7,35,11],[36,1,36,11],[37,1,37,2],[37,3,40,3],[37,6,40,6],[37,7,37,11],[38,1,38,2],[38,7,38,11],[39,1,39,2],[39,7,39,11],[40,1,40,2],[40,7,40,11],[41,1,41,11],[42,1,42,2],[42,3,46,3],[42,6,46,6],[42,7,42,11],[43,1,43,2],[43,7,43,11],[44,1,44,2],[44,7,44,11],[45,1,45,2],[45,7,45,11],[46,1,46,2],[46,7,46,11],[47,1,47,2],[47,3,49,3],[47,6,49,6],[47,7,47,11],[48,1,48,2],[48,7,48,11],[49,1,49,2],[49,7,49,11],[50,1,50,3],[50,9,50,11],[51,1,51,3],[51,7,51,9],[51,10,51,11],[54,1,54,11],[56,9,56,11],[52,1,52,3],[52,4,52,5],[52,8,52,9],[53,1,53,3],[53,4,53,5],[53,7,53,9]]}
[null,null,null,null,null,null,null,null,null,null,"NIVEAU 2"]
[]
[null,"COMMISSION D'UTILISATION TROUPEAUX"]
[null,"Epreuve de travail sur Ovins\nTRADITIONAL STYLE CLASSE 2"]
[null,"ORGANISATEUR :",{"$f":"Fiche_organisateur_N°1!E15","v":0}]
[null,"Lieu :",{"$f":"Fiche_organisateur_N°1!E16","v":0},null,null,null,null,"Date :",{"$f":"IF(Fiche_organisateur_N°1!E13=\"\",\"\",Fiche_organisateur_N°1!E13)","v":""}]
[null,"Contact :",{"$f":"Fiche_organisateur_N°1!E18","v":0}]
[]
[null,"PROPRIETAIRE :",{"$f":"Fiche_organisateur_N°2!C21","v":0},null,null,null,null,"Race et sexe",{"$f":"Fiche_organisateur_N°2!G21","v":0}]
[null,"CONDUCTEUR :",{"$f":"Fiche_organisateur_N°2!D21","v":0},null,null,null,null,"N° FAPAC :",{"$f":"Fiche_organisateur_N°2!K21","v":0}]
[null,"NOM DU CHIEN :",{"$f":"Fiche_organisateur_N°2!E21","v":0},null,null,null,null,"AFFIXE :",{"$f":"Fiche_organisateur_N°2!F21","v":0}]
[null,null,null,null,null,null,null,"N° d'Identification",{"$f":"Fiche_organisateur_N°2!L21","v":0},null,null,null,null,"Contrôle de saisie (sur les onglets 01 à 20 )"]
[]
[null,null,null,null,null,null,null,null,null,null,null,null,null,"Ces colonnes n'apparaissent pas lors de l'impression…"]
[null,"Epreuves                ",null,null,"Pointages /100",null,null,{"$f":"IF(OR('00'!N51<>30,LEFT('00'!H51,9)=\"ATTENTION\")=1,\"NON VALIDE => corriger la feuille 00 ! ! !\",\"Observations\")","v":"Observations"},null,null,null,null,null,"contrôle-1",null,"contrôle-2"]
[null,{"$f":"IF('00'!B16=\"\",\" -\",'00'!B16)","v":" -"}]
[null,{"$f":"IF('00'!B17=\"\",\" -\",'00'!B17)","v":"Sortie de parc ou bergerie / Exit from the pen "},null,{"$f":"IF('00'!D17=\"\",\"\",'00'!D17)","v":20},null,{"$f":"IF('00'!F17=\"\",\"\",'00'!F17)","v":15},{"$f":"SUM(F17:F22)","v":20},null,null,null,null,null,null,{"$f":"IF(B17=\"\",\"\",IF(E17>F17,\"! ? !\",\"OK\"))","v":"OK"},null,{"$f":"IF(AND(B17=\" -\",E17<>0),\"! ? !\",\"OK\")","v":"OK"}]
[null,{"$f":"IF('00'!B18=\"\",\" -\",'00'!B18)","v":" -"},null,null,null,{"$f":"IF('00'!F18=\"\",\"\",'00'!F18)","v":""},null,null,null,null,null,null,null,"OK",null,"OK",null,"Contrôle-1 : Contrôle que les valeurs entrées ne sont pas supérieures"]
[null,{"$f":"IF('00'!B19=\"\",\" -\",'00'!B19)","v":" -"},null,null,null,{"$f":"IF('00'!F19=\"\",\"\",'00'!F19)","v":""},null,null,null,null,null,null,null,"OK",null,"OK",null,"                    aux pointages maxi attribués à chaque épreuve…"]
[null,{"$f":"IF('00'!B20=\"\",\" -\",'00'!B20)","v":" -"},null,null,null,{"$f":"IF('00'!F20=\"\",\"\",'00'!F20)","v":""},null,null,null,null,null,null,null,"OK",null,"OK"]
[null,{"$f":"IF('00'!B21=\"\",\" -\",'00'!B21)","v":" -"},null,null,null,{"$f":"IF('00'!F21=\"\",\"\",'00'!F21)","v":""},null,null,null,null,null,null,null,"OK",null,"OK"]
[null,{"$f":"IF('00'!B22=\"\",\" -\",'00'!B22)","v":"Rentrée du troupeau  / Re-pen"},null,null,null,{"$f":"IF('00'!F22=\"\",\"\",'00'!F22)","v":5},null,null,null,null,null,null,null,"OK",null,"OK"]
[null,{"$f":"IF('00'!B23=\"\",\" -\",'00'!B23)","v":" -"}]
[null,{"$f":"IF('00'!B24=\"\",\" -\",'00'!B24)","v":"Pont/ Bridge"},null,{"$f":"IF('00'!D24=\"\",\"\",'00'!D24)","v":15},null,{"$f":"IF('00'!F24=\"\",\"\",'00'!F24)","v":5},{"$f":"SUM(F24:F28)","v":15},null,null,null,null,null,null,{"$f":"IF(B24=\"\",\"\",IF(E24>F24,\"! ? !\",\"OK\"))","v":"OK"},null,{"$f":"IF(AND(B24=\" -\",E24<>0),\"! ? !\",\"OK\")","v":"OK"}]
[null,{"$f":"IF('00'!B25=\"\",\" -\",'00'!B25)","v":"obstacle A"},null,null,null,{"$f":"IF('00'!F25=\"\",\"\",'00'!F25)","v":10},null,null,null,null,null,null,null,{"$f":"IF(B25=\"\",\"\",IF(E25>F25,\"! ? !\",\"OK\"))","v":"OK"},null,{"$f":"IF(AND(B25=\" -\",E25<>0),\"! ? !\",\"OK\")","v":"OK"}]
[null,{"$f":"IF('00'!B26=\"\",\" -\",'00'!B26)","v":"Qbstacle B"},null,null,null,{"$f":"IF('00'!F26=\"\",\"\",'00'!F26)","v":""},null,null,null,null,null,null,null,{"$f":"IF(B26=\"\",\"\",IF(E26>F26,\"! ? !\",\"OK\"))","v":"OK"},null,{"$f":"IF(AND(B26=\" -\",E26<>0),\"! ? !\",\"OK\")","v":"OK"}]
[null,{"$f":"IF('00'!B27=\"\",\" -\",'00'!B27)","v":"Obstacle C"},null,null,null,{"$f":"IF('00'!F27=\"\",\"\",'00'!F27)","v":""},null,null,null,null,null,null,null,{"$f":"IF(B27=\"\",\"\",IF(E27>F27,\"! ? !\",\"OK\"))","v":"OK"},null,{"$f":"IF(AND(B27=\" -\",E27<>0),\"! ? !\",\"OK\")","v":"OK"}]
[null,{"$f":"IF('00'!B28=\"\",\" -\",'00'!B28)","v":" -"},null,null,null,{"$f":"IF('00'!F28=\"\",\"\",'00'!F28)","v":""},null,null,null,null,null,null,null,{"$f":"IF(B28=\"\",\"\",IF(E28>F28,\"! ? !\",\"OK\"))","v":"OK"},null,{"$f":"IF(AND(B28=\" -\",E28<>0),\"! ? !\",\"OK\")","v":"OK"}]
[null,{"$f":"IF('00'!B29=\"\",\" -\",'00'!B29)","v":" -"}]
[null,{"$f":"IF('00'!B30=\"\",\" -\",'00'!B30)","v":"Conduite /Moving"},null,{"$f":"IF('00'!D30=\"\",\"\",'00'!D30)","v":45},null,{"$f":"IF('00'!F30=\"\",\"\",'00'!F30)","v":20},{"$f":"SUM(F30:F36)","v":45},null,null,null,null,null,null,{"$f":"IF(B30=\"\",\"\",IF(E30>F30,\"! ? !\",\"OK\"))","v":"OK"},null,{"$f":"IF(AND(B30=\" -\",E30<>0),\"! ? !\",\"OK\")","v":"OK"},null,"Contrôle-2 : Contrôle que les lignes sans épreuve ne contiennent pas de note"]
[null,{"$f":"IF('00'!B31=\"\",\" -\",'00'!B31)","v":"Pâturage / Grazing"},null,null,null,{"$f":"IF('00'!F31=\"\",\"\",'00'!F31)","v":20},null,null,null,null,null,null,null,"OK",null,"OK"]
[null,{"$f":"IF('00'!B32=\"\",\" -\",'00'!B32)","v":"Prise de brebis/ catching sheep and holding a sheep "},null,null,null,{"$f":"IF('00'!F32=\"\",\"\",'00'!F32)","v":5},null,null,null,null,null,null,null,"OK",null,"OK"]
[null,{"$f":"IF('00'!B33=\"\",\" -\",'00'!B33)","v":"Protection de cultures/ Crop protection "},null,null,null,{"$f":"IF('00'!F33=\"\",\"\",'00'!F33)","v":""},null,null,null,null,null,null,null,"OK",null,"OK"]
[null,{"$f":"IF('00'!B34=\"\",\" -\",'00'!B34)","v":"Traffic/ Vehicule "},null,null,null,{"$f":"IF('00'!F34=\"\",\"\",'00'!F34)","v":""},null,null,null,null,null,null,null,"OK",null,"OK"]
[null,{"$f":"IF('00'!B35=\"\",\" -\",'00'!B35)","v":" -"},null,null,null,{"$f":"IF('00'!F35=\"\",\"\",'00'!F35)","v":""},null,null,null,null,null,null,null,"OK",null,"OK"]
[null,{"$f":"IF('00'!B36=\"\",\" -\",'00'!B36)","v":" -"},null,null,null,{"$f":"IF('00'!F36=\"\",\"\",'00'!F36)","v":""},null,null,null,null,null,null,null,"OK",null,"OK"]
[null,{"$f":"IF('00'!B37=\"\",\" -\",'00'!B37)","v":" -"}]
[null,{"$f":"IF('00'!B38=\"\",\" -\",'00'!B38)","v":"Arrêt du troupeau / Stop 1"},null,{"$f":"IF('00'!D38=\"\",\"\",'00'!D38)","v":10},null,{"$f":"IF('00'!F38=\"\",\"\",'00'!F38)","v":10},{"$f":"SUM(F38:F41)","v":10},null,null,null,null,null,null,{"$f":"IF(B38=\"\",\"\",IF(E38>F38,\"! ? !\",\"OK\"))","v":"OK"},null,{"$f":"IF(AND(B38=\" -\",E38<>0),\"! ? !\",\"OK\")","v":"OK"}]
[null,{"$f":"IF('00'!B39=\"\",\" -\",'00'!B39)","v":"Arrêt du troupeau / Stop 2"},null,null,null,{"$f":"IF('00'!F39=\"\",\"\",'00'!F39)","v":""},null,null,null,null,null,null,null,{"$f":"IF(B39=\"\",\"\",IF(E39>F39,\"! ? !\",\"OK\"))","v":"OK"},null,{"$f":"IF(AND(B39=\" -\",E39<>0),\"! ? !\",\"OK\")","v":"OK"}]
[null,{"$f":"IF('00'!B40=\"\",\" -\",'00'!B40)","v":"Arrêt du troupeau / Stop 3"},null,null,null,{"$f":"IF('00'!F40=\"\",\"\",'00'!F40)","v":""},null,null,null,null,null,null,null,{"$f":"IF(B40=\"\",\"\",IF(E40>F40,\"! ? !\",\"OK\"))","v":"OK"},null,{"$f":"IF(AND(B40=\" -\",E40<>0),\"! ? !\",\"OK\")","v":"OK"}]
[null,{"$f":"IF('00'!B41=\"\",\" -\",'00'!B41)","v":" -"},null,null,null,{"$f":"IF('00'!F41=\"\",\"\",'00'!F41)","v":""},null,null,null,null,null,null,null,{"$f":"IF(B41=\"\",\"\",IF(E41>F41,\"! ? !\",\"OK\"))","v":"OK"},null,{"$f":"IF(AND(B41=\" -\",E41<>0),\"! ? !\",\"OK\")","v":"OK"}]
[null,{"$f":"IF('00'!B42=\"\",\" -\",'00'!B42)","v":" -"}]
[null,{"$f":"IF('00'!B43=\"\",\" -\",'00'!B43)","v":"Aptitude naturelle / Natural ability "},null,{"$f":"IF('00'!D43=\"\",\"\",'00'!D43)","v":10},null,{"$f":"IF('00'!F43=\"\",\"\",'00'!F43)","v":3},{"$f":"SUM(F43:F47)","v":10},null,null,null,null,null,null,{"$f":"IF(B43=\"\",\"\",IF(E43>F43,\"! ? !\",\"OK\"))","v":"OK"},null,{"$f":"IF(AND(B43=\" -\",E43<>0),\"! ? !\",\"OK\")","v":"OK"}]
[null,{"$f":"IF('00'!B44=\"\",\" -\",'00'!B44)","v":"Absence d’agressivité/ gentleness "},null,null,null,{"$f":"IF('00'!F44=\"\",\"\",'00'!F44)","v":2},null,null,null,null,null,null,null,"OK",null,"OK"]
[null,{"$f":"IF('00'!B45=\"\",\" -\",'00'!B45)","v":"Intelligence d’exécution/ Intelligence of execution  "},null,null,null,{"$f":"IF('00'!F45=\"\",\"\",'00'!F45)","v":2},null,null,null,null,null,null,null,"OK",null,"OK"]
[null,{"$f":"IF('00'!B46=\"\",\" -\",'00'!B46)","v":"Obéissance / Obedience "},null,null,null,{"$f":"IF('00'!F46=\"\",\"\",'00'!F46)","v":3},null,null,null,null,null,null,null,"OK",null,"OK"]
[null,{"$f":"IF('00'!B47=\"\",\" -\",'00'!B47)","v":" -"},null,null,null,{"$f":"IF('00'!F47=\"\",\"\",'00'!F47)","v":""},null,null,null,null,null,null,null,"OK",null,"OK"]
[null,{"$f":"IF('00'!B48=\"\",\" -\",'00'!B48)","v":" -"},null,{"$f":"IF('00'!D48=\"\",\"\",'00'!D48)","v":""},null,{"$f":"IF('00'!F48=\"\",\"\",'00'!F48)","v":""},{"$f":"SUM(F48:F50)","v":0},null,null,null,null,null,null,"OK",null,"OK"]
[null,{"$f":"IF('00'!B49=\"\",\" -\",'00'!B49)","v":" -"},null,null,null,{"$f":"IF('00'!F49=\"\",\"\",'00'!F49)","v":""},null,null,null,null,null,null,null,"OK",null,"OK"," "]
[null,{"$f":"IF('00'!B50=\"\",\" -\",'00'!B50)","v":" -"},null,null,null,{"$f":"IF('00'!F50=\"\",\"\",'00'!F50)","v":""},null,null,null,null,null,null,null,"OK",null,"OK"]
[null,"Pointage du Travail  ==>  ",null,null,{"$f":"SUM(E17:E50)","v":0},{"$f":"SUM(F17:F50)","v":100},null,null,"Temps = "]
[null,"Pénalités Générales :\n(chiffre négatif)    .",null,null,null,null,null,"Informations sur les pénalités générales :\n   \n   \n   ",null,null,"Classement :",null,null,{"$f":"IF(E52=\"\",\"\",IF(E52>0,\"ATTENTION : 'Pénalité Générales' doit être un nombre négatif ! \",\"OK\"))","v":""}]
[null,"TOTAL GENERAL =",null,null,{"$f":"IF(COUNT(E17:E50)=0,\"-\",E51+E52)","v":"-"},null,null,"Qualificatif :",{"$f":"IF(E53=\"-\",\"-\",IF(E53>89.9999,\"EXCELLENT\",IF(E53>79.9999,\"TRES BON\",IF(E53>69.999,\"BON\",IF(E53>59.999,\"Satisfaisant\",IF(E53>0.1,\"insuffisant \",\"éliminé \"))))))","v":"-"},{"$f":"IF(F53=\"-\",\"-\",IF(F53>89.9999,\"EXCELLENT\",IF(F53>79.9999,\"TRES BON\",IF(F53>69.999,\"BON\",IF(F53>59.999,\"satisfaisant\",\" - \")))))","v":" - "},{"$f":"Fiche_organisateur_N°2!P21","v":"X"},{"$f":"'Rapport de Concours'!D40","v":0}]
[null,"CACITR / RCACITR / CACTR / RCACTR :",null,null," -",null,null," <== sur décision du juge "]
[null,"Observations :  ",null,null,null,null,null,null,null,null,null,null,{"$f":"M51+M52","v":0}]
[]
[null,null,null,null,null,null,null,null,"Le Juge :",{"$f":"Fiche_organisateur_N°1!E28","v":0}]

{"sheet":"06","index":13,"n_rows":57,"n_cols":18,"rows_kept":57,"cut":false,"hidden":false,"merged":[[10,8,10,9],[0,10,0,11],[2,1,2,11],[8,8,8,9],[9,8,9,9],[3,2,3,9],[11,8,11,9],[14,4,14,5],[14,7,14,11],[15,1,15,11],[16,1,16,2],[16,3,21,3],[16,6,21,6],[16,7,16,11],[17,1,17,2],[17,7,17,11],[18,1,18,2],[18,7,18,11],[19,1,19,2],[19,7,19,11],[20,1,20,2],[20,7,20,11],[28,1,28,11],[21,1,21,2],[21,7,21,11],[22,1,22,11],[23,1,23,2],[23,3,27,3],[23,6,27,6],[23,7,23,11],[24,1,24,2],[24,7,24,11],[25,1,25,2],[25,7,25,11],[26,1,26,2],[26,7,26,11],[27,1,27,2],[27,7,27,11],[29,1,29,2],[29,3,35,3],[29,6,35,6],[29,7,29,11],[30,1,30,2],[30,7,30,11],[31,1,31,2],[31,7,31,11],[32,1,32,2],[32,7,32,11],[33,1,33,2],[33,7,33,11],[34,1,34,2],[34,7,34,11],[35,1,35,2],[35,7,35,11],[36,1,36,11],[37,1,37,2],[37,3,40,3],[37,6,40,6],[37,7,37,11],[38,1,38,2],[38,7,38,11],[39,1,39,2],[39,7,39,11],[40,1,40,2],[40,7,40,11],[41,1,41,11],[42,1,42,2],[42,3,46,3],[42,6,46,6],[42,7,42,11],[43,1,43,2],[43,7,43,11],[44,1,44,2],[44,7,44,11],[45,1,45,2],[45,7,45,11],[46,1,46,2],[46,7,46,11],[47,1,47,2],[47,3,49,3],[47,6,49,6],[47,7,47,11],[48,1,48,2],[48,7,48,11],[49,1,49,2],[49,7,49,11],[50,1,50,3],[50,9,50,11],[51,1,51,3],[51,7,51,9],[51,10,51,11],[54,1,54,11],[56,9,56,11],[52,1,52,3],[52,4,52,5],[52,8,52,9],[53,1,53,3],[53,4,53,5],[53,7,53,9]]}
[null,null,null,null,null,null,null,null,null,null,{"$f":"Fiche_organisateur_N°1!$E$26","v":"IHT 1"}]
[]
[null,"COMMISSION D'UTILISATION TROUPEAUX"]
[null,null,"Epreuve de travail sur Ovins - TRADITIONAL STYLE "]
[null,"ORGANISATEUR :",{"$f":"Fiche_organisateur_N°1!E15","v":0}]
[null,"Lieu :",{"$f":"Fiche_organisateur_N°1!E16","v":0},null,null,null,null,"Date :",{"$f":"Fiche_organisateur_N°1!$E$13","v":0}]
[null,"Contact :",{"$f":"Fiche_organisateur_N°1!E18","v":0}]
[]
[null,"PROPRIETAIRE :",{"$f":"Fiche_organisateur_N°2!C22","v":0},null,null,null,null,"Race et sexe",{"$f":"Fiche_organisateur_N°2!G22","v":0}]
[null,"CONDUCTEUR :",{"$f":"Fiche_organisateur_N°2!D22","v":0},null,null,null,null,"N° FAPAC :",{"$f":"Fiche_organisateur_N°2!K22","v":0}]
[null,"NOM DU CHIEN :",{"$f":"Fiche_organisateur_N°2!E22","v":0},null,null,null,null,"AFFIXE :",{"$f":"Fiche_organisateur_N°2!F22","v":0}]
[null,null,null,null,null,null,null,"N° d'Identification",{"$f":"Fiche_organisateur_N°2!L22","v":0},null,null,null,null,"Contrôle de saisie (sur les onglets 01 à 20 )"]
[]
[null,null,null,null,null,null,null,null,null,null,null,null,null,"Ces colonnes n'apparaissent pas lors de l'impression…"]
[null,"Epreuves                ",null,null,"Pointages /100",null,null,{"$f":"IF(OR('00'!N51<>30,LEFT('00'!H51,9)=\"ATTENTION\")=1,\"NON VALIDE => corriger la feuille 00 ! ! !\",\"Observations\")","v":"Observations"},null,null,null,null,null,"contrôle-1",null,"contrôle-2"]
[null,{"$f":"IF('00'!B16=\"\",\" -\",'00'!B16)","v":" -"}]
[null,{"$f":"IF('00'!B17=\"\",\" -\",'00'!B17)","v":"Sortie de parc ou bergerie / Exit from the pen "},null,{"$f":"IF('00'!D17=\"\",\"\",'00'!D17)","v":20},null,{"$f":"IF('00'!F17=\"\",\"\",'00'!F17)","v":15},{"$f":"SUM(F17:F22)","v":20},null,null,null,null,null,null,{"$f":"IF(B17=\"\",\"\",IF(E17>F17,\"! ? !\",\"OK\"))","v":"OK"},null,{"$f":"IF(AND(B17=\" -\",E17<>0),\"! ? !\",\"OK\")","v":"OK"}]
[null,{"$f":"IF('00'!B18=\"\",\" -\",'00'!B18)","v":" -"},null,null,null,{"$f":"IF('00'!F18=\"\",\"\",'00'!F18)","v":""},null,null,null,null,null,null,null,"OK",null,"OK",null,"Contrôle-1 : Contrôle que les valeurs entrées ne sont pas supérieures"]
[null,{"$f":"IF('00'!B19=\"\",\" -\",'00'!B19)","v":" -"},null,null,null,{"$f":"IF('00'!F19=\"\",\"\",'00'!F19)","v":""},null,null,null,null,null,null,null,"OK",null,"OK",null,"                    aux pointages maxi attribués à chaque épreuve…"]
[null,{"$f":"IF('00'!B20=\"\",\" -\",'00'!B20)","v":" -"},null,null,null,{"$f":"IF('00'!F20=\"\",\"\",'00'!F20)","v":""},null,null,null,null,null,null,null,"OK",null,"OK"]
[null,{"$f":"IF('00'!B21=\"\",\" -\",'00'!B21)","v":" -"},null,null,null,{"$f":"IF('00'!F21=\"\",\"\",'00'!F21)","v":""},null,null,null,null,null,null,null,"OK",null,"OK"]
[null,{"$f":"IF('00'!B22=\"\",\" -\",'00'!B22)","v":"Rentrée du troupeau  / Re-pen"},null,null,null,{"$f":"IF('00'!F22=\"\",\"\",'00'!F22)","v":5},null,null,null,null,null,null,null,"OK",null,"OK"]
[null,{"$f":"IF('00'!B23=\"\",\" -\",'00'!B23)","v":" -"}]
[null,{"$f":"IF('00'!B24=\"\",\" -\",'00'!B24)","v":"Pont/ Bridge"},null,{"$f":"IF('00'!D24=\"\",\"\",'00'!D24)","v":15},null,{"$f":"IF('00'!F24=\"\",\"\",'00'!F24)","v":5},{"$f":"SUM(F24:F28)","v":15},null,null,null,null,null,null,{"$f":"IF(B24=\"\",\"\",IF(E24>F24,\"! ? !\",\"OK\"))","v":"OK"},null,{"$f":"IF(AND(B24=\" -\",E24<>0),\"! ? !\",\"OK\")","v":"OK"}]
[null,{"$f":"IF('00'!B25=\"\",\" -\",'00'!B25)","v":"obstacle A"},null,null,null,{"$f":"IF('00'!F25=\"\",\"\",'00'!F25)","v":10},null,null,null,null,null,null,null,{"$f":"IF(B25=\"\",\"\",IF(E25>F25,\"! ? !\",\"OK\"))","v":"OK"},null,{"$f":"IF(AND(B25=\" -\",E25<>0),\"! ? !\",\"OK\")","v":"OK"}]
[null,{"$f":"IF('00'!B26=\"\",\" -\",'00'!B26)","v":"Qbstacle B"},null,null,null,{"$f":"IF('00'!F26=\"\",\"\",'00'!F26)","v":""},null,null,null,null,null,null,null,{"$f":"IF(B26=\"\",\"\",IF(E26>F26,\"! ? !\",\"OK\"))","v":"OK"},null,{"$f":"IF(AND(B26=\" -\",E26<>0),\"! ? !\",\"OK\")","v":"OK"}]
[null,{"$f":"IF('00'!B27=\"\",\" -\",'00'!B27)","v":"Obstacle C"},null,null,null,{"$f":"IF('00'!F27=\"\",\"\",'00'!F27)","v":""},null,null,null,null,null,null,null,{"$f":"IF(B27=\"\",\"\",IF(E27>F27,\"! ? !\",\"OK\"))","v":"OK"},null,{"$f":"IF(AND(B27=\" -\",E27<>0),\"! ? !\",\"OK\")","v":"OK"}]
[null,{"$f":"IF('00'!B28=\"\",\" -\",'00'!B28)","v":" -"},null,null,null,{"$f":"IF('00'!F28=\"\",\"\",'00'!F28)","v":""},null,null,null,null,null,null,null,{"$f":"IF(B28=\"\",\"\",IF(E28>F28,\"! ? !\",\"OK\"))","v":"OK"},null,{"$f":"IF(AND(B28=\" -\",E28<>0),\"! ? !\",\"OK\")","v":"OK"}]
[null,{"$f":"IF('00'!B29=\"\",\" -\",'00'!B29)","v":" -"}]
[null,{"$f":"IF('00'!B30=\"\",\" -\",'00'!B30)","v":"Conduite /Moving"},null,{"$f":"IF('00'!D30=\"\",\"\",'00'!D30)","v":45},null,{"$f":"IF('00'!F30=\"\",\"\",'00'!F30)","v":20},{"$f":"SUM(F30:F36)","v":45},null,null,null,null,null,null,{"$f":"IF(B30=\"\",\"\",IF(E30>F30,\"! ? !\",\"OK\"))","v":"OK"},null,{"$f":"IF(AND(B30=\" -\",E30<>0),\"! ? !\",\"OK\")","v":"OK"},null,"Contrôle-2 : Contrôle que les lignes sans épreuve ne contiennent pas de note"]
[null,{"$f":"IF('00'!B31=\"\",\" -\",'00'!B31)","v":"Pâturage / Grazing"},null,null,null,{"$f":"IF('00'!F31=\"\",\"\",'00'!F31)","v":20},null,null,null,null,null,null,null,"OK",null,"OK"]
[null,{"$f":"IF('00'!B32=\"\",\" -\",'00'!B32)","v":"Prise de brebis/ catching sheep and holding a sheep "},null,null,null,{"$f":"IF('00'!F32=\"\",\"\",'00'!F32)","v":5},null,null,null,null,null,null,null,"OK",null,"OK"]
[null,{"$f":"IF('00'!B33=\"\",\" -\",'00'!B33)","v":"Protection de cultures/ Crop protection "},null,null,null,{"$f":"IF('00'!F33=\"\",\"\",'00'!F33)","v":""},null,null,null,null,null,null,null,"OK",null,"OK"]
[null,{"$f":"IF('00'!B34=\"\",\" -\",'00'!B34)","v":"Traffic/ Vehicule "},null,null,null,{"$f":"IF('00'!F34=\"\",\"\",'00'!F34)","v":""},null,null,null,null,null,null,null,"OK",null,"OK"]
[null,{"$f":"IF('00'!B35=\"\",\" -\",'00'!B35)","v":" -"},null,null,null,{"$f":"IF('00'!F35=\"\",\"\",'00'!F35)","v":""},null,null,null,null,null,null,null,"OK",null,"OK"]
[null,{"$f":"IF('00'!B36=\"\",\" -\",'00'!B36)","v":" -"},null,null,null,{"$f":"IF('00'!F36=\"\",\"\",'00'!F36)","v":""},null,null,null,null,null,null,null,"OK",null,"OK"]
[null,{"$f":"IF('00'!B37=\"\",\" -\",'00'!B37)","v":" -"}]
[null,{"$f":"IF('00'!B38=\"\",\" -\",'00'!B38)","v":"Arrêt du troupeau / Stop 1"},null,{"$f":"IF('00'!D38=\"\",\"\",'00'!D38)","v":10},null,{"$f":"IF('00'!F38=\"\",\"\",'00'!F38)","v":10},{"$f":"SUM(F38:F41)","v":10},null,null,null,null,null,null,{"$f":"IF(B38=\"\",\"\",IF(E38>F38,\"! ? !\",\"OK\"))","v":"OK"},null,{"$f":"IF(AND(B38=\" -\",E38<>0),\"! ? !\",\"OK\")","v":"OK"}]
[null,{"$f":"IF('00'!B39=\"\",\" -\",'00'!B39)","v":"Arrêt du troupeau / Stop 2"},null,null,null,{"$f":"IF('00'!F39=\"\",\"\",'00'!F39)","v":""},null,null,null,null,null,null,null,{"$f":"IF(B39=\"\",\"\",IF(E39>F39,\"! ? !\",\"OK\"))","v":"OK"},null,{"$f":"IF(AND(B39=\" -\",E39<>0),\"! ? !\",\"OK\")","v":"OK"}]
[null,{"$f":"IF('00'!B40=\"\",\" -\",'00'!B40)","v":"Arrêt du troupeau / Stop 3"},null,null,null,{"$f":"IF('00'!F40=\"\",\"\",'00'!F40)","v":""},null,null,null,null,null,null,null,{"$f":"IF(B40=\"\",\"\",IF(E40>F40,\"! ? !\",\"OK\"))","v":"OK"},null,{"$f":"IF(AND(B40=\" -\",E40<>0),\"! ? !\",\"OK\")","v":"OK"}]
[null,{"$f":"IF('00'!B41=\"\",\" -\",'00'!B41)","v":" -"},null,null,null,{"$f":"IF('00'!F41=\"\",\"\",'00'!F41)","v":""},null,null,null,null,null,null,null,{"$f":"IF(B41=\"\",\"\",IF(E41>F41,\"! ? !\",\"OK\"))","v":"OK"},null,{"$f":"IF(AND(B41=\" -\",E41<>0),\"! ? !\",\"OK\")","v":"OK"}]
[null,{"$f":"IF('00'!B42=\"\",\" -\",'00'!B42)","v":" -"}]
[null,{"$f":"IF('00'!B43=\"\",\" -\",'00'!B43)","v":"Aptitude naturelle / Natural ability "},null,{"$f":"IF('00'!D43=\"\",\"\",'00'!D43)","v":10},null,{"$f":"IF('00'!F43=\"\",\"\",'00'!F43)","v":3},{"$f":"SUM(F43:F47)","v":10},null,null,null,null,null,null,{"$f":"IF(B43=\"\",\"\",IF(E43>F43,\"! ? !\",\"OK\"))","v":"OK"},null,{"$f":"IF(AND(B43=\" -\",E43<>0),\"! ? !\",\"OK\")","v":"OK"}]
[null,{"$f":"IF('00'!B44=\"\",\" -\",'00'!B44)","v":"Absence d’agressivité/ gentleness "},null,null,null,{"$f":"IF('00'!F44=\"\",\"\",'00'!F44)","v":2},null,null,null,null,null,null,null,"OK",null,"OK"]
[null,{"$f":"IF('00'!B45=\"\",\" -\",'00'!B45)","v":"Intelligence d’exécution/ Intelligence of execution  "},null,null,null,{"$f":"IF('00'!F45=\"\",\"\",'00'!F45)","v":2},null,null,null,null,null,null,null,"OK",null,"OK"]
[null,{"$f":"IF('00'!B46=\"\",\" -\",'00'!B46)","v":"Obéissance / Obedience "},null,null,null,{"$f":"IF('00'!F46=\"\",\"\",'00'!F46)","v":3},null,null,null,null,null,null,null,"OK",null,"OK"]
[null,{"$f":"IF('00'!B47=\"\",\" -\",'00'!B47)","v":" -"},null,null,null,{"$f":"IF('00'!F47=\"\",\"\",'00'!F47)","v":""},null,null,null,null,null,null,null,"OK",null,"OK"]
[null,{"$f":"IF('00'!B48=\"\",\" -\",'00'!B48)","v":" -"},null,{"$f":"IF('00'!D48=\"\",\"\",'00'!D48)","v":""},null,{"$f":"IF('00'!F48=\"\",\"\",'00'!F48)","v":""},{"$f":"SUM(F48:F50)","v":0},null,null,null,null,null,null,"OK",null,"OK"]
[null,{"$f":"IF('00'!B49=\"\",\" -\",'00'!B49)","v":" -"},null,null,null,{"$f":"IF('00'!F49=\"\",\"\",'00'!F49)","v":""},null,null,null,null,null,null,null,"OK",null,"OK"," "]
[null,{"$f":"IF('00'!B50=\"\",\" -\",'00'!B50)","v":" -"},null,null,null,{"$f":"IF('00'!F50=\"\",\"\",'00'!F50)","v":""},null,null,null,null,null,null,null,"OK",null,"OK"]
[null,"Pointage du Travail  ==>  ",null,null,{"$f":"SUM(E17:E50)","v":0},{"$f":"SUM(F17:F50)","v":100},null,null,"Temps = "]
[null,"Pénalités Générales :\n(chiffre négatif)    .",null,null,null,null,null,"Informations sur les pénalités générales :\n   \n   \n   ",null,null,"Classement :",null,null,{"$f":"IF(E52=\"\",\"\",IF(E52>0,\"ATTENTION : 'Pénalité Générales' doit être un nombre négatif ! \",\"OK\"))","v":""}]
[null,"TOTAL GENERAL =",null,null,{"$f":"IF(COUNT(E17:E50)=0,\"-\",E51+E52)","v":"-"},null,null,"Qualificatif :",{"$f":"IF(E53=\"-\",\"-\",IF(E53>89.9999,\"EXCELLENT\",IF(E53>79.9999,\"TRES BON\",IF(E53>69.999,\"BON\",IF(E53>59.999,\"Satisfaisant\",IF(E53>0.1,\"insuffisant \",\"éliminé \"))))))","v":"-"},{"$f":"IF(F53=\"-\",\"-\",IF(F53>89.9999,\"EXCELLENT\",IF(F53>79.9999,\"TRES BON\",IF(F53>69.999,\"BON\",IF(F53>59.999,\"satisfaisant\",\" - \")))))","v":" - "},{"$f":"Fiche_organisateur_N°2!P22","v":"X"},{"$f":"'Rapport de Concours'!D40","v":0}]
[null,"CACITR / RCACITR / CACTR / RCACTR :",null,null," -",null,null," <== sur décision du juge "]
[null,"Observations :  ",null,null,null,null,null,null,null,null,null,null,{"$f":"M51+M52","v":0}]
[]
[null,null,null,null,null,null,null,null,"Le Juge :",{"$f":"Fiche_organisateur_N°1!E28","v":0}]

{"sheet":"07","index":14,"n_rows":57,"n_cols":18,"rows_kept":57,"cut":false,"hidden":false,"merged":[[10,8,10,9],[0,10,0,11],[2,1,2,11],[8,8,8,9],[9,8,9,9],[3,2,3,9],[11,8,11,9],[14,4,14,5],[14,7,14,11],[15,1,15,11],[16,1,16,2],[16,3,21,3],[16,6,21,6],[16,7,16,11],[17,1,17,2],[17,7,17,11],[18,1,18,2],[18,7,18,11],[19,1,19,2],[19,7,19,11],[20,1,20,2],[20,7,20,11],[28,1,28,11],[21,1,21,2],[21,7,21,11],[22,1,22,11],[23,1,23,2],[23,3,27,3],[23,6,27,6],[23,7,23,11],[24,1,24,2],[24,7,24,11],[25,1,25,2],[25,7,25,11],[26,1,26,2],[26,7,26,11],[27,1,27,2],[27,7,27,11],[29,1,29,2],[29,3,35,3],[29,6,35,6],[29,7,29,11],[30,1,30,2],[30,7,30,11],[31,1,31,2],[31,7,31,11],[32,1,32,2],[32,7,32,11],[33,1,33,2],[33,7,33,11],[34,1,34,2],[34,7,34,11],[35,1,35,2],[35,7,35,11],[36,1,36,11],[37,1,37,2],[37,3,40,3],[37,6,40,6],[37,7,37,11],[38,1,38,2],[38,7,38,11],[39,1,39,2],[39,7,39,11],[40,1,40,2],[40,7,40,11],[41,1,41,11],[42,1,42,2],[42,3,46,3],[42,6,46,6],[42,7,42,11],[43,1,43,2],[43,7,43,11],[44,1,44,2],[44,7,44,11],[45,1,45,2],[45,7,45,11],[46,1,46,2],[46,7,46,11],[47,1,47,2],[47,3,49,3],[47,6,49,6],[47,7,47,11],[48,1,48,2],[48,7,48,11],[49,1,49,2],[49,7,49,11],[50,1,50,3],[50,9,50,11],[51,1,51,3],[51,7,51,9],[51,10,51,11],[54,1,54,11],[56,9,56,11],[52,1,52,3],[52,4,52,5],[52,8,52,9],[53,1,53,3],[53,4,53,5],[53,7,53,9]]}
[null,null,null,null,null,null,null,null,null,null,{"$f":"Fiche_organisateur_N°1!$E$26","v":"IHT 1"}]
[]
[null,"COMMISSION D'UTILISATION TROUPEAUX"]
[null,null,"Epreuve de travail sur Ovins - TRADITIONAL STYLE "]
[null,"ORGANISATEUR :",{"$f":"Fiche_organisateur_N°1!E15","v":0}]
[null,"Lieu :",{"$f":"Fiche_organisateur_N°1!E16","v":0},null,null,null,null,"Date :",{"$f":"Fiche_organisateur_N°1!$E$13","v":0}]
[null,"Contact :",{"$f":"Fiche_organisateur_N°1!E18","v":0}]
[]
[null,"PROPRIETAIRE :",{"$f":"Fiche_organisateur_N°2!C23","v":0},null,null,null,null,"Race et sexe",{"$f":"Fiche_organisateur_N°2!G23","v":0}]
[null,"CONDUCTEUR :",{"$f":"Fiche_organisateur_N°2!D23","v":0},null,null,null,null,"N° FAPAC :",{"$f":"Fiche_organisateur_N°2!K23","v":0}]
[null,"NOM DU CHIEN :",{"$f":"Fiche_organisateur_N°2!E23","v":0},null,null,null,null,"AFFIXE :",{"$f":"Fiche_organisateur_N°2!F23","v":0}]
[null,null,null,null,null,null,null,"N° d'Identification",{"$f":"Fiche_organisateur_N°2!L23","v":0},null,null,null,null,"Contrôle de saisie (sur les onglets 01 à 20 )"]
[]
[null,null,null,null,null,null,null,null,null,null,null,null,null,"Ces colonnes n'apparaissent pas lors de l'impression…"]
[null,"Epreuves                ",null,null,"Pointages /100",null,null,{"$f":"IF(OR('00'!N51<>30,LEFT('00'!H51,9)=\"ATTENTION\")=1,\"NON VALIDE => corriger la feuille 00 ! ! !\",\"Observations\")","v":"Observations"},null,null,null,null,null,"contrôle-1",null,"contrôle-2"]
[null,{"$f":"IF('00'!B16=\"\",\" -\",'00'!B16)","v":" -"}]
[null,{"$f":"IF('00'!B17=\"\",\" -\",'00'!B17)","v":"Sortie de parc ou bergerie / Exit from the pen "},null,{"$f":"IF('00'!D17=\"\",\"\",'00'!D17)","v":20},null,{"$f":"IF('00'!F17=\"\",\"\",'00'!F17)","v":15},{"$f":"SUM(F17:F22)","v":20},null,null,null,null,null,null,{"$f":"IF(B17=\"\",\"\",IF(E17>F17,\"! ? !\",\"OK\"))","v":"OK"},null,{"$f":"IF(AND(B17=\" -\",E17<>0),\"! ? !\",\"OK\")","v":"OK"}]
[null,{"$f":"IF('00'!B18=\"\",\" -\",'00'!B18)","v":" -"},null,null,null,{"$f":"IF('00'!F18=\"\",\"\",'00'!F18)","v":""},null,null,null,null,null,null,null,"OK",null,"OK",null,"Contrôle-1 : Contrôle que les valeurs entrées ne sont pas supérieures"]
[null,{"$f":"IF('00'!B19=\"\",\" -\",'00'!B19)","v":" -"},null,null,null,{"$f":"IF('00'!F19=\"\",\"\",'00'!F19)","v":""},null,null,null,null,null,null,null,"OK",null,"OK",null,"                    aux pointages maxi attribués à chaque épreuve…"]
[null,{"$f":"IF('00'!B20=\"\",\" -\",'00'!B20)","v":" -"},null,null,null,{"$f":"IF('00'!F20=\"\",\"\",'00'!F20)","v":""},null,null,null,null,null,null,null,"OK",null,"OK"]
[null,{"$f":"IF('00'!B21=\"\",\" -\",'00'!B21)","v":" -"},null,null,null,{"$f":"IF('00'!F21=\"\",\"\",'00'!F21)","v":""},null,null,null,null,null,null,null,"OK",null,"OK"]
[null,{"$f":"IF('00'!B22=\"\",\" -\",'00'!B22)","v":"Rentrée du troupeau  / Re-pen"},null,null,null,{"$f":"IF('00'!F22=\"\",\"\",'00'!F22)","v":5},null,null,null,null,null,null,null,"OK",null,"OK"]
[null,{"$f":"IF('00'!B23=\"\",\" -\",'00'!B23)","v":" -"}]
[null,{"$f":"IF('00'!B24=\"\",\" -\",'00'!B24)","v":"Pont/ Bridge"},null,{"$f":"IF('00'!D24=\"\",\"\",'00'!D24)","v":15},null,{"$f":"IF('00'!F24=\"\",\"\",'00'!F24)","v":5},{"$f":"SUM(F24:F28)","v":15},null,null,null,null,null,null,{"$f":"IF(B24=\"\",\"\",IF(E24>F24,\"! ? !\",\"OK\"))","v":"OK"},null,{"$f":"IF(AND(B24=\" -\",E24<>0),\"! ? !\",\"OK\")","v":"OK"}]
[null,{"$f":"IF('00'!B25=\"\",\" -\",'00'!B25)","v":"obstacle A"},null,null,null,{"$f":"IF('00'!F25=\"\",\"\",'00'!F25)","v":10},null,null,null,null,null,null,null,{"$f":"IF(B25=\"\",\"\",IF(E25>F25,\"! ? !\",\"OK\"))","v":"OK"},null,{"$f":"IF(AND(B25=\" -\",E25<>0),\"! ? !\",\"OK\")","v":"OK"}]
[null,{"$f":"IF('00'!B26=\"\",\" -\",'00'!B26)","v":"Qbstacle B"},null,null,null,{"$f":"IF('00'!F26=\"\",\"\",'00'!F26)","v":""},null,null,null,null,null,null,null,{"$f":"IF(B26=\"\",\"\",IF(E26>F26,\"! ? !\",\"OK\"))","v":"OK"},null,{"$f":"IF(AND(B26=\" -\",E26<>0),\"! ? !\",\"OK\")","v":"OK"}]
[null,{"$f":"IF('00'!B27=\"\",\" -\",'00'!B27)","v":"Obstacle C"},null,null,null,{"$f":"IF('00'!F27=\"\",\"\",'00'!F27)","v":""},null,null,null,null,null,null,null,{"$f":"IF(B27=\"\",\"\",IF(E27>F27,\"! ? !\",\"OK\"))","v":"OK"},null,{"$f":"IF(AND(B27=\" -\",E27<>0),\"! ? !\",\"OK\")","v":"OK"}]
[null,{"$f":"IF('00'!B28=\"\",\" -\",'00'!B28)","v":" -"},null,null,null,{"$f":"IF('00'!F28=\"\",\"\",'00'!F28)","v":""},null,null,null,null,null,null,null,{"$f":"IF(B28=\"\",\"\",IF(E28>F28,\"! ? !\",\"OK\"))","v":"OK"},null,{"$f":"IF(AND(B28=\" -\",E28<>0),\"! ? !\",\"OK\")","v":"OK"}]
[null,{"$f":"IF('00'!B29=\"\",\" -\",'00'!B29)","v":" -"}]
[null,{"$f":"IF('00'!B30=\"\",\" -\",'00'!B30)","v":"Conduite /Moving"},null,{"$f":"IF('00'!D30=\"\",\"\",'00'!D30)","v":45},null,{"$f":"IF('00'!F30=\"\",\"\",'00'!F30)","v":20},{"$f":"SUM(F30:F36)","v":45},null,null,null,null,null,null,{"$f":"IF(B30=\"\",\"\",IF(E30>F30,\"! ? !\",\"OK\"))","v":"OK"},null,{"$f":"IF(AND(B30=\" -\",E30<>0),\"! ? !\",\"OK\")","v":"OK"},null,"Contrôle-2 : Contrôle que les lignes sans épreuve ne contiennent pas de note"]
[null,{"$f":"IF('00'!B31=\"\",\" -\",'00'!B31)","v":"Pâturage / Grazing"},null,null,null,{"$f":"IF('00'!F31=\"\",\"\",'00'!F31)","v":20},null,null,null,null,null,null,null,"OK",null,"OK"]
[null,{"$f":"IF('00'!B32=\"\",\" -\",'00'!B32)","v":"Prise de brebis/ catching sheep and holding a sheep "},null,null,null,{"$f":"IF('00'!F32=\"\",\"\",'00'!F32)","v":5},null,null,null,null,null,null,null,"OK",null,"OK"]
[null,{"$f":"IF('00'!B33=\"\",\" -\",'00'!B33)","v":"Protection de cultures/ Crop protection "},null,null,null,{"$f":"IF('00'!F33=\"\",\"\",'00'!F33)","v":""},null,null,null,null,null,null,null,"OK",null,"OK"]
[null,{"$f":"IF('00'!B34=\"\",\" -\",'00'!B34)","v":"Traffic/ Vehicule "},null,null,null,{"$f":"IF('00'!F34=\"\",\"\",'00'!F34)","v":""},null,null,null,null,null,null,null,"OK",null,"OK"]
[null,{"$f":"IF('00'!B35=\"\",\" -\",'00'!B35)","v":" -"},null,null,null,{"$f":"IF('00'!F35=\"\",\"\",'00'!F35)","v":""},null,null,null,null,null,null,null,"OK",null,"OK"]
[null,{"$f":"IF('00'!B36=\"\",\" -\",'00'!B36)","v":" -"},null,null,null,{"$f":"IF('00'!F36=\"\",\"\",'00'!F36)","v":""},null,null,null,null,null,null,null,"OK",null,"OK"]
[null,{"$f":"IF('00'!B37=\"\",\" -\",'00'!B37)","v":" -"}]
[null,{"$f":"IF('00'!B38=\"\",\" -\",'00'!B38)","v":"Arrêt du troupeau / Stop 1"},null,{"$f":"IF('00'!D38=\"\",\"\",'00'!D38)","v":10},null,{"$f":"IF('00'!F38=\"\",\"\",'00'!F38)","v":10},{"$f":"SUM(F38:F41)","v":10},null,null,null,null,null,null,{"$f":"IF(B38=\"\",\"\",IF(E38>F38,\"! ? !\",\"OK\"))","v":"OK"},null,{"$f":"IF(AND(B38=\" -\",E38<>0),\"! ? !\",\"OK\")","v":"OK"}]
[null,{"$f":"IF('00'!B39=\"\",\" -\",'00'!B39)","v":"Arrêt du troupeau / Stop 2"},null,null,null,{"$f":"IF('00'!F39=\"\",\"\",'00'!F39)","v":""},null,null,null,null,null,null,null,{"$f":"IF(B39=\"\",\"\",IF(E39>F39,\"! ? !\",\"OK\"))","v":"OK"},null,{"$f":"IF(AND(B39=\" -\",E39<>0),\"! ? !\",\"OK\")","v":"OK"}]
[null,{"$f":"IF('00'!B40=\"\",\" -\",'00'!B40)","v":"Arrêt du troupeau / Stop 3"},null,null,null,{"$f":"IF('00'!F40=\"\",\"\",'00'!F40)","v":""},null,null,null,null,null,null,null,{"$f":"IF(B40=\"\",\"\",IF(E40>F40,\"! ? !\",\"OK\"))","v":"OK"},null,{"$f":"IF(AND(B40=\" -\",E40<>0),\"! ? !\",\"OK\")","v":"OK"}]
[null,{"$f":"IF('00'!B41=\"\",\" -\",'00'!B41)","v":" -"},null,null,null,{"$f":"IF('00'!F41=\"\",\"\",'00'!F41)","v":""},null,null,null,null,null,null,null,{"$f":"IF(B41=\"\",\"\",IF(E41>F41,\"! ? !\",\"OK\"))","v":"OK"},null,{"$f":"IF(AND(B41=\" -\",E41<>0),\"! ? !\",\"OK\")","v":"OK"}]
[null,{"$f":"IF('00'!B42=\"\",\" -\",'00'!B42)","v":" -"}]
[null,{"$f":"IF('00'!B43=\"\",\" -\",'00'!B43)","v":"Aptitude naturelle / Natural ability "},null,{"$f":"IF('00'!D43=\"\",\"\",'00'!D43)","v":10},null,{"$f":"IF('00'!F43=\"\",\"\",'00'!F43)","v":3},{"$f":"SUM(F43:F47)","v":10},null,null,null,null,null,null,{"$f":"IF(B43=\"\",\"\",IF(E43>F43,\"! ? !\",\"OK\"))","v":"OK"},null,{"$f":"IF(AND(B43=\" -\",E43<>0),\"! ? !\",\"OK\")","v":"OK"}]
[null,{"$f":"IF('00'!B44=\"\",\" -\",'00'!B44)","v":"Absence d’agressivité/ gentleness "},null,null,null,{"$f":"IF('00'!F44=\"\",\"\",'00'!F44)","v":2},null,null,null,null,null,null,null,"OK",null,"OK"]
[null,{"$f":"IF('00'!B45=\"\",\" -\",'00'!B45)","v":"Intelligence d’exécution/ Intelligence of execution  "},null,null,null,{"$f":"IF('00'!F45=\"\",\"\",'00'!F45)","v":2},null,null,null,null,null,null,null,"OK",null,"OK"]
[null,{"$f":"IF('00'!B46=\"\",\" -\",'00'!B46)","v":"Obéissance / Obedience "},null,null,null,{"$f":"IF('00'!F46=\"\",\"\",'00'!F46)","v":3},null,null,null,null,null,null,null,"OK",null,"OK"]
[null,{"$f":"IF('00'!B47=\"\",\" -\",'00'!B47)","v":" -"},null,null,null,{"$f":"IF('00'!F47=\"\",\"\",'00'!F47)","v":""},null,null,null,null,null,null,null,"OK",null,"OK"]
[null,{"$f":"IF('00'!B48=\"\",\" -\",'00'!B48)","v":" -"},null,{"$f":"IF('00'!D48=\"\",\"\",'00'!D48)","v":""},null,{"$f":"IF('00'!F48=\"\",\"\",'00'!F48)","v":""},{"$f":"SUM(F48:F50)","v":0},null,null,null,null,null,null,"OK",null,"OK"]
[null,{"$f":"IF('00'!B49=\"\",\" -\",'00'!B49)","v":" -"},null,null,null,{"$f":"IF('00'!F49=\"\",\"\",'00'!F49)","v":""},null,null,null,null,null,null,null,"OK",null,"OK"," "]
[null,{"$f":"IF('00'!B50=\"\",\" -\",'00'!B50)","v":" -"},null,null,null,{"$f":"IF('00'!F50=\"\",\"\",'00'!F50)","v":""},null,null,null,null,null,null,null,"OK",null,"OK"]
[null,"Pointage du Travail  ==>  ",null,null,{"$f":"SUM(E17:E50)","v":0},{"$f":"SUM(F17:F50)","v":100},null,null,"Temps = "]
[null,"Pénalités Générales :\n(chiffre négatif)    .",null,null,null,null,null,"Informations sur les pénalités générales :\n   \n   \n   ",null,null,"Classement :",null,null,{"$f":"IF(E52=\"\",\"\",IF(E52>0,\"ATTENTION : 'Pénalité Générales' doit être un nombre négatif ! \",\"OK\"))","v":""}]
[null,"TOTAL GENERAL =",null,null,{"$f":"IF(COUNT(E17:E50)=0,\"-\",E51+E52)","v":"-"},null,null,"Qualificatif :",{"$f":"IF(E53=\"-\",\"-\",IF(E53>89.9999,\"EXCELLENT\",IF(E53>79.9999,\"TRES BON\",IF(E53>69.999,\"BON\",IF(E53>59.999,\"Satisfaisant\",IF(E53>0.1,\"insuffisant \",\"éliminé \"))))))","v":"-"},null,{"$f":"Fiche_organisateur_N°2!P23","v":"X"},{"$f":"'Rapport de Concours'!D40","v":0}]
[null,"CACITR / RCACITR / CACTR / RCACTR :",null,null," -",null,null," <== sur décision du juge "]
[null,"Observations :  ",null,null,null,null,null,null,null,null,null,null,{"$f":"M51+M52","v":0}]
[]
[null,null,null,null,null,null,null,null,"Le Juge :",{"$f":"Fiche_organisateur_N°1!E28","v":0}]

{"sheet":"08","index":15,"n_rows":57,"n_cols":18,"rows_kept":57,"cut":false,"hidden":false,"merged":[[10,8,10,9],[0,10,0,11],[2,1,2,11],[8,8,8,9],[9,8,9,9],[3,2,3,9],[11,8,11,9],[14,4,14,5],[14,7,14,11],[15,1,15,11],[16,1,16,2],[16,3,21,3],[16,6,21,6],[16,7,16,11],[17,1,17,2],[17,7,17,11],[18,1,18,2],[18,7,18,11],[19,1,19,2],[19,7,19,11],[20,1,20,2],[20,7,20,11],[28,1,28,11],[21,1,21,2],[21,7,21,11],[22,1,22,11],[23,1,23,2],[23,3,27,3],[23,6,27,6],[23,7,23,11],[24,1,24,2],[24,7,24,11],[25,1,25,2],[25,7,25,11],[26,1,26,2],[26,7,26,11],[27,1,27,2],[27,7,27,11],[29,1,29,2],[29,3,35,3],[29,6,35,6],[29,7,29,11],[30,1,30,2],[30,7,30,11],[31,1,31,2],[31,7,31,11],[32,1,32,2],[32,7,32,11],[33,1,33,2],[33,7,33,11],[34,1,34,2],[34,7,34,11],[35,1,35,2],[35,7,35,11],[36,1,36,11],[37,1,37,2],[37,3,40,3],[37,6,40,6],[37,7,37,11],[38,1,38,2],[38,7,38,11],[39,1,39,2],[39,7,39,11],[40,1,40,2],[40,7,40,11],[41,1,41,11],[42,1,42,2],[42,3,46,3],[42,6,46,6],[42,7,42,11],[43,1,43,2],[43,7,43,11],[44,1,44,2],[44,7,44,11],[45,1,45,2],[45,7,45,11],[46,1,46,2],[46,7,46,11],[47,1,47,2],[47,3,49,3],[47,6,49,6],[47,7,47,11],[48,1,48,2],[48,7,48,11],[49,1,49,2],[49,7,49,11],[50,1,50,3],[50,9,50,11],[51,1,51,3],[51,7,51,9],[51,10,51,11],[54,1,54,11],[56,9,56,11],[52,1,52,3],[52,4,52,5],[52,8,52,9],[53,1,53,3],[53,4,53,5],[53,7,53,9]]}
[null,null,null,null,null,null,null,null,null,null,{"$f":"Fiche_organisateur_N°1!$E$26","v":"IHT 1"}]
[]
[null,"COMMISSION D'UTILISATION TROUPEAUX"]
[null,null,"Epreuve de travail sur Ovins - TRADITIONAL STYLE "]
[null,"ORGANISATEUR :",{"$f":"Fiche_organisateur_N°1!E15","v":0}]
[null,"Lieu :",{"$f":"Fiche_organisateur_N°1!E16","v":0},null,null,null,null,"Date :",{"$f":"Fiche_organisateur_N°1!$E$13","v":0}]
[null,"Contact :",{"$f":"Fiche_organisateur_N°1!E18","v":0}]
[]
[null,"PROPRIETAIRE :",{"$f":"Fiche_organisateur_N°2!C24","v":0},null,null,null,null,"Race et sexe",{"$f":"Fiche_organisateur_N°2!G24","v":0}]
[null,"CONDUCTEUR :",{"$f":"Fiche_organisateur_N°2!D24","v":0},null,null,null,null,"N° FAPAC :",{"$f":"Fiche_organisateur_N°2!K24","v":0}]
[null,"NOM DU CHIEN :",{"$f":"Fiche_organisateur_N°2!E24","v":0},null,null,null,null,"AFFIXE :",{"$f":"Fiche_organisateur_N°2!F24","v":0}]
[null,null,null,null,null,null,null,"N° d'Identification",{"$f":"Fiche_organisateur_N°2!L24","v":0},null,null,null,null,"Contrôle de saisie (sur les onglets 01 à 20 )"]
[]
[null,null,null,null,null,null,null,null,null,null,null,null,null,"Ces colonnes n'apparaissent pas lors de l'impression…"]
[null,"Epreuves                ",null,null,"Pointages /100",null,null,{"$f":"IF(OR('00'!N51<>30,LEFT('00'!H51,9)=\"ATTENTION\")=1,\"NON VALIDE => corriger la feuille 00 ! ! !\",\"Observations\")","v":"Observations"},null,null,null,null,null,"contrôle-1",null,"contrôle-2"]
[null,{"$f":"IF('00'!B16=\"\",\" -\",'00'!B16)","v":" -"}]
[null,{"$f":"IF('00'!B17=\"\",\" -\",'00'!B17)","v":"Sortie de parc ou bergerie / Exit from the pen "},null,{"$f":"IF('00'!D17=\"\",\"\",'00'!D17)","v":20},null,{"$f":"IF('00'!F17=\"\",\"\",'00'!F17)","v":15},{"$f":"SUM(F17:F22)","v":20},null,null,null,null,null,null,{"$f":"IF(B17=\"\",\"\",IF(E17>F17,\"! ? !\",\"OK\"))","v":"OK"},null,{"$f":"IF(AND(B17=\" -\",E17<>0),\"! ? !\",\"OK\")","v":"OK"}]
[null,{"$f":"IF('00'!B18=\"\",\" -\",'00'!B18)","v":" -"},null,null,null,{"$f":"IF('00'!F18=\"\",\"\",'00'!F18)","v":""},null,null,null,null,null,null,null,"OK",null,"OK",null,"Contrôle-1 : Contrôle que les valeurs entrées ne sont pas supérieures"]
[null,{"$f":"IF('00'!B19=\"\",\" -\",'00'!B19)","v":" -"},null,null,null,{"$f":"IF('00'!F19=\"\",\"\",'00'!F19)","v":""},null,null,null,null,null,null,null,"OK",null,"OK",null,"                    aux pointages maxi attribués à chaque épreuve…"]
[null,{"$f":"IF('00'!B20=\"\",\" -\",'00'!B20)","v":" -"},null,null,null,{"$f":"IF('00'!F20=\"\",\"\",'00'!F20)","v":""},null,null,null,null,null,null,null,"OK",null,"OK"]
[null,{"$f":"IF('00'!B21=\"\",\" -\",'00'!B21)","v":" -"},null,null,null,{"$f":"IF('00'!F21=\"\",\"\",'00'!F21)","v":""},null,null,null,null,null,null,null,"OK",null,"OK"]
[null,{"$f":"IF('00'!B22=\"\",\" -\",'00'!B22)","v":"Rentrée du troupeau  / Re-pen"},null,null,null,{"$f":"IF('00'!F22=\"\",\"\",'00'!F22)","v":5},null,null,null,null,null,null,null,"OK",null,"OK"]
[null,{"$f":"IF('00'!B23=\"\",\" -\",'00'!B23)","v":" -"}]
[null,{"$f":"IF('00'!B24=\"\",\" -\",'00'!B24)","v":"Pont/ Bridge"},null,{"$f":"IF('00'!D24=\"\",\"\",'00'!D24)","v":15},null,{"$f":"IF('00'!F24=\"\",\"\",'00'!F24)","v":5},{"$f":"SUM(F24:F28)","v":15},null,null,null,null,null,null,{"$f":"IF(B24=\"\",\"\",IF(E24>F24,\"! ? !\",\"OK\"))","v":"OK"},null,{"$f":"IF(AND(B24=\" -\",E24<>0),\"! ? !\",\"OK\")","v":"OK"}]
[null,{"$f":"IF('00'!B25=\"\",\" -\",'00'!B25)","v":"obstacle A"},null,null,null,{"$f":"IF('00'!F25=\"\",\"\",'00'!F25)","v":10},null,null,null,null,null,null,null,{"$f":"IF(B25=\"\",\"\",IF(E25>F25,\"! ? !\",\"OK\"))","v":"OK"},null,{"$f":"IF(AND(B25=\" -\",E25<>0),\"! ? !\",\"OK\")","v":"OK"}]
[null,{"$f":"IF('00'!B26=\"\",\" -\",'00'!B26)","v":"Qbstacle B"},null,null,null,{"$f":"IF('00'!F26=\"\",\"\",'00'!F26)","v":""},null,null,null,null,null,null,null,{"$f":"IF(B26=\"\",\"\",IF(E26>F26,\"! ? !\",\"OK\"))","v":"OK"},null,{"$f":"IF(AND(B26=\" -\",E26<>0),\"! ? !\",\"OK\")","v":"OK"}]
[null,{"$f":"IF('00'!B27=\"\",\" -\",'00'!B27)","v":"Obstacle C"},null,null,null,{"$f":"IF('00'!F27=\"\",\"\",'00'!F27)","v":""},null,null,null,null,null,null,null,{"$f":"IF(B27=\"\",\"\",IF(E27>F27,\"! ? !\",\"OK\"))","v":"OK"},null,{"$f":"IF(AND(B27=\" -\",E27<>0),\"! ? !\",\"OK\")","v":"OK"}]
[null,{"$f":"IF('00'!B28=\"\",\" -\",'00'!B28)","v":" -"},null,null,null,{"$f":"IF('00'!F28=\"\",\"\",'00'!F28)","v":""},null,null,null,null,null,null,null,{"$f":"IF(B28=\"\",\"\",IF(E28>F28,\"! ? !\",\"OK\"))","v":"OK"},null,{"$f":"IF(AND(B28=\" -\",E28<>0),\"! ? !\",\"OK\")","v":"OK"}]
[null,{"$f":"IF('00'!B29=\"\",\" -\",'00'!B29)","v":" -"}]
[null,{"$f":"IF('00'!B30=\"\",\" -\",'00'!B30)","v":"Conduite /Moving"},null,{"$f":"IF('00'!D30=\"\",\"\",'00'!D30)","v":45},null,{"$f":"IF('00'!F30=\"\",\"\",'00'!F30)","v":20},{"$f":"SUM(F30:F36)","v":45},null,null,null,null,null,null,{"$f":"IF(B30=\"\",\"\",IF(E30>F30,\"! ? !\",\"OK\"))","v":"OK"},null,{"$f":"IF(AND(B30=\" -\",E30<>0),\"! ? !\",\"OK\")","v":"OK"},null,"Contrôle-2 : Contrôle que les lignes sans épreuve ne contiennent pas de note"]
[null,{"$f":"IF('00'!B31=\"\",\" -\",'00'!B31)","v":"Pâturage / Grazing"},null,null,null,{"$f":"IF('00'!F31=\"\",\"\",'00'!F31)","v":20},null,null,null,null,null,null,null,"OK",null,"OK"]
[null,{"$f":"IF('00'!B32=\"\",\" -\",'00'!B32)","v":"Prise de brebis/ catching sheep and holding a sheep "},null,null,null,{"$f":"IF('00'!F32=\"\",\"\",'00'!F32)","v":5},null,null,null,null,null,null,null,"OK",null,"OK"]
[null,{"$f":"IF('00'!B33=\"\",\" -\",'00'!B33)","v":"Protection de cultures/ Crop protection "},null,null,null,{"$f":"IF('00'!F33=\"\",\"\",'00'!F33)","v":""},null,null,null,null,null,null,null,"OK",null,"OK"]
[null,{"$f":"IF('00'!B34=\"\",\" -\",'00'!B34)","v":"Traffic/ Vehicule "},null,null,null,{"$f":"IF('00'!F34=\"\",\"\",'00'!F34)","v":""},null,null,null,null,null,null,null,"OK",null,"OK"]
[null,{"$f":"IF('00'!B35=\"\",\" -\",'00'!B35)","v":" -"},null,null,null,{"$f":"IF('00'!F35=\"\",\"\",'00'!F35)","v":""},null,null,null,null,null,null,null,"OK",null,"OK"]
[null,{"$f":"IF('00'!B36=\"\",\" -\",'00'!B36)","v":" -"},null,null,null,{"$f":"IF('00'!F36=\"\",\"\",'00'!F36)","v":""},null,null,null,null,null,null,null,"OK",null,"OK"]
[null,{"$f":"IF('00'!B37=\"\",\" -\",'00'!B37)","v":" -"}]
[null,{"$f":"IF('00'!B38=\"\",\" -\",'00'!B38)","v":"Arrêt du troupeau / Stop 1"},null,{"$f":"IF('00'!D38=\"\",\"\",'00'!D38)","v":10},null,{"$f":"IF('00'!F38=\"\",\"\",'00'!F38)","v":10},{"$f":"SUM(F38:F41)","v":10},null,null,null,null,null,null,{"$f":"IF(B38=\"\",\"\",IF(E38>F38,\"! ? !\",\"OK\"))","v":"OK"},null,{"$f":"IF(AND(B38=\" -\",E38<>0),\"! ? !\",\"OK\")","v":"OK"}]
[null,{"$f":"IF('00'!B39=\"\",\" -\",'00'!B39)","v":"Arrêt du troupeau / Stop 2"},null,null,null,{"$f":"IF('00'!F39=\"\",\"\",'00'!F39)","v":""},null,null,null,null,null,null,null,{"$f":"IF(B39=\"\",\"\",IF(E39>F39,\"! ? !\",\"OK\"))","v":"OK"},null,{"$f":"IF(AND(B39=\" -\",E39<>0),\"! ? !\",\"OK\")","v":"OK"}]
[null,{"$f":"IF('00'!B40=\"\",\" -\",'00'!B40)","v":"Arrêt du troupeau / Stop 3"},null,null,null,{"$f":"IF('00'!F40=\"\",\"\",'00'!F40)","v":""},null,null,null,null,null,null,null,{"$f":"IF(B40=\"\",\"\",IF(E40>F40,\"! ? !\",\"OK\"))","v":"OK"},null,{"$f":"IF(AND(B40=\" -\",E40<>0),\"! ? !\",\"OK\")","v":"OK"}]
[null,{"$f":"IF('00'!B41=\"\",\" -\",'00'!B41)","v":" -"},null,null,null,{"$f":"IF('00'!F41=\"\",\"\",'00'!F41)","v":""},null,null,null,null,null,null,null,{"$f":"IF(B41=\"\",\"\",IF(E41>F41,\"! ? !\",\"OK\"))","v":"OK"},null,{"$f":"IF(AND(B41=\" -\",E41<>0),\"! ? !\",\"OK\")","v":"OK"}]
[null,{"$f":"IF('00'!B42=\"\",\" -\",'00'!B42)","v":" -"}]
[null,{"$f":"IF('00'!B43=\"\",\" -\",'00'!B43)","v":"Aptitude naturelle / Natural ability "},null,{"$f":"IF('00'!D43=\"\",\"\",'00'!D43)","v":10},null,{"$f":"IF('00'!F43=\"\",\"\",'00'!F43)","v":3},{"$f":"SUM(F43:F47)","v":10},null,null,null,null,null,null,{"$f":"IF(B43=\"\",\"\",IF(E43>F43,\"! ? !\",\"OK\"))","v":"OK"},null,{"$f":"IF(AND(B43=\" -\",E43<>0),\"! ? !\",\"OK\")","v":"OK"}]
[null,{"$f":"IF('00'!B44=\"\",\" -\",'00'!B44)","v":"Absence d’agressivité/ gentleness "},null,null,null,{"$f":"IF('00'!F44=\"\",\"\",'00'!F44)","v":2},null,null,null,null,null,null,null,"OK",null,"OK"]
[null,{"$f":"IF('00'!B45=\"\",\" -\",'00'!B45)","v":"Intelligence d’exécution/ Intelligence of execution  "},null,null,null,{"$f":"IF('00'!F45=\"\",\"\",'00'!F45)","v":2},null,null,null,null,null,null,null,"OK",null,"OK"]
[null,{"$f":"IF('00'!B46=\"\",\" -\",'00'!B46)","v":"Obéissance / Obedience "},null,null,null,{"$f":"IF('00'!F46=\"\",\"\",'00'!F46)","v":3},null,null,null,null,null,null,null,"OK",null,"OK"]
[null,{"$f":"IF('00'!B47=\"\",\" -\",'00'!B47)","v":" -"},null,null,null,{"$f":"IF('00'!F47=\"\",\"\",'00'!F47)","v":""},null,null,null,null,null,null,null,"OK",null,"OK"]
[null,{"$f":"IF('00'!B48=\"\",\" -\",'00'!B48)","v":" -"},null,{"$f":"IF('00'!D48=\"\",\"\",'00'!D48)","v":""},null,{"$f":"IF('00'!F48=\"\",\"\",'00'!F48)","v":""},{"$f":"SUM(F48:F50)","v":0},null,null,null,null,null,null,"OK",null,"OK"]
[null,{"$f":"IF('00'!B49=\"\",\" -\",'00'!B49)","v":" -"},null,null,null,{"$f":"IF('00'!F49=\"\",\"\",'00'!F49)","v":""},null,null,null,null,null,null,null,"OK",null,"OK"," "]
[null,{"$f":"IF('00'!B50=\"\",\" -\",'00'!B50)","v":" -"},null,null,null,{"$f":"IF('00'!F50=\"\",\"\",'00'!F50)","v":""},null,null,null,null,null,null,null,"OK",null,"OK"]
[null,"Pointage du Travail  ==>  ",null,null,{"$f":"SUM(E17:E50)","v":0},{"$f":"SUM(F17:F50)","v":100},null,null,"Temps = "]
[null,"Pénalités Générales :\n(chiffre négatif)    .",null,null,null,null,null,"Informations sur les pénalités générales :\n   \n   \n   ",null,null,"Classement :",null,null,{"$f":"IF(E52=\"\",\"\",IF(E52>0,\"ATTENTION : 'Pénalité Générales' doit être un nombre négatif ! \",\"OK\"))","v":""}]
[null,"TOTAL GENERAL =",null,null,{"$f":"IF(COUNT(E17:E50)=0,\"-\",E51+E52)","v":"-"},null,null,"Qualificatif :",{"$f":"IF(E53=\"-\",\"-\",IF(E53>89.9999,\"EXCELLENT\",IF(E53>79.9999,\"TRES BON\",IF(E53>69.999,\"BON\",IF(E53>59.999,\"Satisfaisant\",IF(E53>0.1,\"insuffisant \",\"éliminé \"))))))","v":"-"},null,{"$f":"Fiche_organisateur_N°2!P24","v":"X"},{"$f":"'Rapport de Concours'!D40","v":0}]
[null,"CACITR / RCACITR / CACTR / RCACTR :",null,null," -",null,null," <== sur décision du juge "]
[null,"Observations :  ",null,null,null,null,null,null,null,null,null,null,{"$f":"M51+M52","v":0}]
[]
[null,null,null,null,null,null,null,null,"Le Juge :",{"$f":"Fiche_organisateur_N°1!E28","v":0}]

{"sheet":"09","index":16,"n_rows":57,"n_cols":18,"rows_kept":57,"cut":false,"hidden":false,"merged":[[10,8,10,9],[0,10,0,11],[2,1,2,11],[8,8,8,9],[9,8,9,9],[3,2,3,9],[11,8,11,9],[14,4,14,5],[14,7,14,11],[15,1,15,11],[16,1,16,2],[16,3,21,3],[16,6,21,6],[16,7,16,11],[17,1,17,2],[17,7,17,11],[18,1,18,2],[18,7,18,11],[19,1,19,2],[19,7,19,11],[20,1,20,2],[20,7,20,11],[28,1,28,11],[21,1,21,2],[21,7,21,11],[22,1,22,11],[23,1,23,2],[23,3,27,3],[23,6,27,6],[23,7,23,11],[24,1,24,2],[24,7,24,11],[25,1,25,2],[25,7,25,11],[26,1,26,2],[26,7,26,11],[27,1,27,2],[27,7,27,11],[29,1,29,2],[29,3,35,3],[29,6,35,6],[29,7,29,11],[30,1,30,2],[30,7,30,11],[31,1,31,2],[31,7,31,11],[32,1,32,2],[32,7,32,11],[33,1,33,2],[33,7,33,11],[34,1,34,2],[34,7,34,11],[35,1,35,2],[35,7,35,11],[36,1,36,11],[37,1,37,2],[37,3,40,3],[37,6,40,6],[37,7,37,11],[38,1,38,2],[38,7,38,11],[39,1,39,2],[39,7,39,11],[40,1,40,2],[40,7,40,11],[41,1,41,11],[42,1,42,2],[42,3,46,3],[42,6,46,6],[42,7,42,11],[43,1,43,2],[43,7,43,11],[44,1,44,2],[44,7,44,11],[45,1,45,2],[45,7,45,11],[46,1,46,2],[46,7,46,11],[47,1,47,2],[47,3,49,3],[47,6,49,6],[47,7,47,11],[48,1,48,2],[48,7,48,11],[49,1,49,2],[49,7,49,11],[50,1,50,3],[50,9,50,11],[51,1,51,3],[51,7,51,9],[51,10,51,11],[54,1,54,11],[56,9,56,11],[52,1,52,3],[52,4,52,5],[52,8,52,9],[53,1,53,3],[53,4,53,5],[53,7,53,9]]}
[null,null,null,null,null,null,null,null,null,null,{"$f":"Fiche_organisateur_N°1!$E$26","v":"IHT 1"}]
[]
[null,"COMMISSION D'UTILISATION TROUPEAUX"]
[null,null,"Epreuve de travail sur Ovins - TRADITIONAL STYLE "]
[null,"ORGANISATEUR :",{"$f":"Fiche_organisateur_N°1!E15","v":0}]
[null,"Lieu :",{"$f":"Fiche_organisateur_N°1!E16","v":0},null,null,null,null,"Date :",{"$f":"Fiche_organisateur_N°1!$E$13","v":0}]
[null,"Contact :",{"$f":"Fiche_organisateur_N°1!E18","v":0}]
[]
[null,"PROPRIETAIRE :",{"$f":"Fiche_organisateur_N°2!C25","v":0},null,null,null,null,"Race et sexe",{"$f":"Fiche_organisateur_N°2!G25","v":0}]
[null,"CONDUCTEUR :",{"$f":"Fiche_organisateur_N°2!D25","v":0},null,null,null,null,"N° FAPAC :",{"$f":"Fiche_organisateur_N°2!K25","v":0}]
[null,"NOM DU CHIEN :",{"$f":"Fiche_organisateur_N°2!E25","v":0},null,null,null,null,"AFFIXE :",{"$f":"Fiche_organisateur_N°2!F25","v":0}]
[null,null,null,null,null,null,null,"N° d'Identification",{"$f":"Fiche_organisateur_N°2!L25","v":0},null,null,null,null,"Contrôle de saisie (sur les onglets 01 à 20 )"]
[]
[null,null,null,null,null,null,null,null,null,null,null,null,null,"Ces colonnes n'apparaissent pas lors de l'impression…"]
[null,"Epreuves                ",null,null,"Pointages /100",null,null,{"$f":"IF(OR('00'!N51<>30,LEFT('00'!H51,9)=\"ATTENTION\")=1,\"NON VALIDE => corriger la feuille 00 ! ! !\",\"Observations\")","v":"Observations"},null,null,null,null,null,"contrôle-1",null,"contrôle-2"]
[null,{"$f":"IF('00'!B16=\"\",\" -\",'00'!B16)","v":" -"}]
[null,{"$f":"IF('00'!B17=\"\",\" -\",'00'!B17)","v":"Sortie de parc ou bergerie / Exit from the pen "},null,{"$f":"IF('00'!D17=\"\",\"\",'00'!D17)","v":20},null,{"$f":"IF('00'!F17=\"\",\"\",'00'!F17)","v":15},{"$f":"SUM(F17:F22)","v":20},null,null,null,null,null,null,{"$f":"IF(B17=\"\",\"\",IF(E17>F17,\"! ? !\",\"OK\"))","v":"OK"},null,{"$f":"IF(AND(B17=\" -\",E17<>0),\"! ? !\",\"OK\")","v":"OK"}]
[null,{"$f":"IF('00'!B18=\"\",\" -\",'00'!B18)","v":" -"},null,null,null,{"$f":"IF('00'!F18=\"\",\"\",'00'!F18)","v":""},null,null,null,null,null,null,null,"OK",null,"OK",null,"Contrôle-1 : Contrôle que les valeurs entrées ne sont pas supérieures"]
[null,{"$f":"IF('00'!B19=\"\",\" -\",'00'!B19)","v":" -"},null,null,null,{"$f":"IF('00'!F19=\"\",\"\",'00'!F19)","v":""},null,null,null,null,null,null,null,"OK",null,"OK",null,"                    aux pointages maxi attribués à chaque épreuve…"]
[null,{"$f":"IF('00'!B20=\"\",\" -\",'00'!B20)","v":" -"},null,null,null,{"$f":"IF('00'!F20=\"\",\"\",'00'!F20)","v":""},null,null,null,null,null,null,null,"OK",null,"OK"]
[null,{"$f":"IF('00'!B21=\"\",\" -\",'00'!B21)","v":" -"},null,null,null,{"$f":"IF('00'!F21=\"\",\"\",'00'!F21)","v":""},null,null,null,null,null,null,null,"OK",null,"OK"]
[null,{"$f":"IF('00'!B22=\"\",\" -\",'00'!B22)","v":"Rentrée du troupeau  / Re-pen"},null,null,null,{"$f":"IF('00'!F22=\"\",\"\",'00'!F22)","v":5},null,null,null,null,null,null,null,"OK",null,"OK"]
[null,{"$f":"IF('00'!B23=\"\",\" -\",'00'!B23)","v":" -"}]
[null,{"$f":"IF('00'!B24=\"\",\" -\",'00'!B24)","v":"Pont/ Bridge"},null,{"$f":"IF('00'!D24=\"\",\"\",'00'!D24)","v":15},null,{"$f":"IF('00'!F24=\"\",\"\",'00'!F24)","v":5},{"$f":"SUM(F24:F28)","v":15},null,null,null,null,null,null,{"$f":"IF(B24=\"\",\"\",IF(E24>F24,\"! ? !\",\"OK\"))","v":"OK"},null,{"$f":"IF(AND(B24=\" -\",E24<>0),\"! ? !\",\"OK\")","v":"OK"}]
[null,{"$f":"IF('00'!B25=\"\",\" -\",'00'!B25)","v":"obstacle A"},null,null,null,{"$f":"IF('00'!F25=\"\",\"\",'00'!F25)","v":10},null,null,null,null,null,null,null,{"$f":"IF(B25=\"\",\"\",IF(E25>F25,\"! ? !\",\"OK\"))","v":"OK"},null,{"$f":"IF(AND(B25=\" -\",E25<>0),\"! ? !\",\"OK\")","v":"OK"}]
[null,{"$f":"IF('00'!B26=\"\",\" -\",'00'!B26)","v":"Qbstacle B"},null,null,null,{"$f":"IF('00'!F26=\"\",\"\",'00'!F26)","v":""},null,null,null,null,null,null,null,{"$f":"IF(B26=\"\",\"\",IF(E26>F26,\"! ? !\",\"OK\"))","v":"OK"},null,{"$f":"IF(AND(B26=\" -\",E26<>0),\"! ? !\",\"OK\")","v":"OK"}]
[null,{"$f":"IF('00'!B27=\"\",\" -\",'00'!B27)","v":"Obstacle C"},null,null,null,{"$f":"IF('00'!F27=\"\",\"\",'00'!F27)","v":""},null,null,null,null,null,null,null,{"$f":"IF(B27=\"\",\"\",IF(E27>F27,\"! ? !\",\"OK\"))","v":"OK"},null,{"$f":"IF(AND(B27=\" -\",E27<>0),\"! ? !\",\"OK\")","v":"OK"}]
[null,{"$f":"IF('00'!B28=\"\",\" -\",'00'!B28)","v":" -"},null,null,null,{"$f":"IF('00'!F28=\"\",\"\",'00'!F28)","v":""},null,null,null,null,null,null,null,{"$f":"IF(B28=\"\",\"\",IF(E28>F28,\"! ? !\",\"OK\"))","v":"OK"},null,{"$f":"IF(AND(B28=\" -\",E28<>0),\"! ? !\",\"OK\")","v":"OK"}]
[null,{"$f":"IF('00'!B29=\"\",\" -\",'00'!B29)","v":" -"}]
[null,{"$f":"IF('00'!B30=\"\",\" -\",'00'!B30)","v":"Conduite /Moving"},null,{"$f":"IF('00'!D30=\"\",\"\",'00'!D30)","v":45},null,{"$f":"IF('00'!F30=\"\",\"\",'00'!F30)","v":20},{"$f":"SUM(F30:F36)","v":45},null,null,null,null,null,null,{"$f":"IF(B30=\"\",\"\",IF(E30>F30,\"! ? !\",\"OK\"))","v":"OK"},null,{"$f":"IF(AND(B30=\" -\",E30<>0),\"! ? !\",\"OK\")","v":"OK"},null,"Contrôle-2 : Contrôle que les lignes sans épreuve ne contiennent pas de note"]
[null,{"$f":"IF('00'!B31=\"\",\" -\",'00'!B31)","v":"Pâturage / Grazing"},null,null,null,{"$f":"IF('00'!F31=\"\",\"\",'00'!F31)","v":20},null,null,null,null,null,null,null,"OK",null,"OK"]
[null,{"$f":"IF('00'!B32=\"\",\" -\",'00'!B32)","v":"Prise de brebis/ catching sheep and holding a sheep "},null,null,null,{"$f":"IF('00'!F32=\"\",\"\",'00'!F32)","v":5},null,null,null,null,null,null,null,"OK",null,"OK"]
[null,{"$f":"IF('00'!B33=\"\",\" -\",'00'!B33)","v":"Protection de cultures/ Crop protection "},null,null,null,{"$f":"IF('00'!F33=\"\",\"\",'00'!F33)","v":""},null,null,null,null,null,null,null,"OK",null,"OK"]
[null,{"$f":"IF('00'!B34=\"\",\" -\",'00'!B34)","v":"Traffic/ Vehicule "},null,null,null,{"$f":"IF('00'!F34=\"\",\"\",'00'!F34)","v":""},null,null,null,null,null,null,null,"OK",null,"OK"]
[null,{"$f":"IF('00'!B35=\"\",\" -\",'00'!B35)","v":" -"},null,null,null,{"$f":"IF('00'!F35=\"\",\"\",'00'!F35)","v":""},null,null,null,null,null,null,null,"OK",null,"OK"]
[null,{"$f":"IF('00'!B36=\"\",\" -\",'00'!B36)","v":" -"},null,null,null,{"$f":"IF('00'!F36=\"\",\"\",'00'!F36)","v":""},null,null,null,null,null,null,null,"OK",null,"OK"]
[null,{"$f":"IF('00'!B37=\"\",\" -\",'00'!B37)","v":" -"}]
[null,{"$f":"IF('00'!B38=\"\",\" -\",'00'!B38)","v":"Arrêt du troupeau / Stop 1"},null,{"$f":"IF('00'!D38=\"\",\"\",'00'!D38)","v":10},null,{"$f":"IF('00'!F38=\"\",\"\",'00'!F38)","v":10},{"$f":"SUM(F38:F41)","v":10},null,null,null,null,null,null,{"$f":"IF(B38=\"\",\"\",IF(E38>F38,\"! ? !\",\"OK\"))","v":"OK"},null,{"$f":"IF(AND(B38=\" -\",E38<>0),\"! ? !\",\"OK\")","v":"OK"}]
[null,{"$f":"IF('00'!B39=\"\",\" -\",'00'!B39)","v":"Arrêt du troupeau / Stop 2"},null,null,null,{"$f":"IF('00'!F39=\"\",\"\",'00'!F39)","v":""},null,null,null,null,null,null,null,{"$f":"IF(B39=\"\",\"\",IF(E39>F39,\"! ? !\",\"OK\"))","v":"OK"},null,{"$f":"IF(AND(B39=\" -\",E39<>0),\"! ? !\",\"OK\")","v":"OK"}]
[null,{"$f":"IF('00'!B40=\"\",\" -\",'00'!B40)","v":"Arrêt du troupeau / Stop 3"},null,null,null,{"$f":"IF('00'!F40=\"\",\"\",'00'!F40)","v":""},null,null,null,null,null,null,null,{"$f":"IF(B40=\"\",\"\",IF(E40>F40,\"! ? !\",\"OK\"))","v":"OK"},null,{"$f":"IF(AND(B40=\" -\",E40<>0),\"! ? !\",\"OK\")","v":"OK"}]
[null,{"$f":"IF('00'!B41=\"\",\" -\",'00'!B41)","v":" -"},null,null,null,{"$f":"IF('00'!F41=\"\",\"\",'00'!F41)","v":""},null,null,null,null,null,null,null,{"$f":"IF(B41=\"\",\"\",IF(E41>F41,\"! ? !\",\"OK\"))","v":"OK"},null,{"$f":"IF(AND(B41=\" -\",E41<>0),\"! ? !\",\"OK\")","v":"OK"}]
[null,{"$f":"IF('00'!B42=\"\",\" -\",'00'!B42)","v":" -"}]
[null,{"$f":"IF('00'!B43=\"\",\" -\",'00'!B43)","v":"Aptitude naturelle / Natural ability "},null,{"$f":"IF('00'!D43=\"\",\"\",'00'!D43)","v":10},null,{"$f":"IF('00'!F43=\"\",\"\",'00'!F43)","v":3},{"$f":"SUM(F43:F47)","v":10},null,null,null,null,null,null,{"$f":"IF(B43=\"\",\"\",IF(E43>F43,\"! ? !\",\"OK\"))","v":"OK"},null,{"$f":"IF(AND(B43=\" -\",E43<>0),\"! ? !\",\"OK\")","v":"OK"}]
[null,{"$f":"IF('00'!B44=\"\",\" -\",'00'!B44)","v":"Absence d’agressivité/ gentleness "},null,null,null,{"$f":"IF('00'!F44=\"\",\"\",'00'!F44)","v":2},null,null,null,null,null,null,null,"OK",null,"OK"]
[null,{"$f":"IF('00'!B45=\"\",\" -\",'00'!B45)","v":"Intelligence d’exécution/ Intelligence of execution  "},null,null,null,{"$f":"IF('00'!F45=\"\",\"\",'00'!F45)","v":2},null,null,null,null,null,null,null,"OK",null,"OK"]
[null,{"$f":"IF('00'!B46=\"\",\" -\",'00'!B46)","v":"Obéissance / Obedience "},null,null,null,{"$f":"IF('00'!F46=\"\",\"\",'00'!F46)","v":3},null,null,null,null,null,null,null,"OK",null,"OK"]
[null,{"$f":"IF('00'!B47=\"\",\" -\",'00'!B47)","v":" -"},null,null,null,{"$f":"IF('00'!F47=\"\",\"\",'00'!F47)","v":""},null,null,null,null,null,null,null,"OK",null,"OK"]
[null,{"$f":"IF('00'!B48=\"\",\" -\",'00'!B48)","v":" -"},null,{"$f":"IF('00'!D48=\"\",\"\",'00'!D48)","v":""},null,{"$f":"IF('00'!F48=\"\",\"\",'00'!F48)","v":""},{"$f":"SUM(F48:F50)","v":0},null,null,null,null,null,null,"OK",null,"OK"]
[null,{"$f":"IF('00'!B49=\"\",\" -\",'00'!B49)","v":" -"},null,null,null,{"$f":"IF('00'!F49=\"\",\"\",'00'!F49)","v":""},null,null,null,null,null,null,null,"OK",null,"OK"," "]
[null,{"$f":"IF('00'!B50=\"\",\" -\",'00'!B50)","v":" -"},null,null,null,{"$f":"IF('00'!F50=\"\",\"\",'00'!F50)","v":""},null,null,null,null,null,null,null,"OK",null,"OK"]
[null,"Pointage du Travail  ==>  ",null,null,{"$f":"SUM(E17:E50)","v":0},{"$f":"SUM(F17:F50)","v":100},null,null,"Temps = ","35'44\""]
[null,"Pénalités Générales :\n(chiffre négatif)    .",null,null,null,null,null,"Informations sur les pénalités générales :\n   \n   \n   ",null,null,"Classement :",null,null,{"$f":"IF(E52=\"\",\"\",IF(E52>0,\"ATTENTION : 'Pénalité Générales' doit être un nombre négatif ! \",\"OK\"))","v":""}]
[null,"TOTAL GENERAL =",null,null,{"$f":"IF(COUNT(E17:E50)=0,\"-\",E51+E52)","v":"-"},null,null,"Qualificatif :",{"$f":"IF(E53=\"-\",\"-\",IF(E53>89.9999,\"EXCELLENT\",IF(E53>79.9999,\"TRES BON\",IF(E53>69.999,\"BON\",IF(E53>59.999,\"Satisfaisant\",IF(E53>0.1,\"insuffisant \",\"éliminé \"))))))","v":"-"},null,{"$f":"Fiche_organisateur_N°2!P25","v":"X"},{"$f":"'Rapport de Concours'!D40","v":0}]
[null,"CACITR / RCACITR / CACTR / RCACTR :",null,null," -",null,null," <== sur décision du juge "]
[null,"Observations :  ",null,null,null,null,null,null,null,null,null,null,{"$f":"M51+M52","v":0}]
[]
[null,null,null,null,null,null,null,null,"Le Juge :",{"$f":"Fiche_organisateur_N°1!E28","v":0}]

{"sheet":"10","index":17,"n_rows":57,"n_cols":18,"rows_kept":57,"cut":false,"hidden":false,"merged":[[10,8,10,9],[0,10,0,11],[2,1,2,11],[8,8,8,9],[9,8,9,9],[3,2,3,9],[11,8,11,9],[14,4,14,5],[14,7,14,11],[15,1,15,11],[16,1,16,2],[16,3,21,3],[16,6,21,6],[16,7,16,11],[17,1,17,2],[17,7,17,11],[18,1,18,2],[18,7,18,11],[19,1,19,2],[19,7,19,11],[20,1,20,2],[20,7,20,11],[28,1,28,11],[21,1,21,2],[21,7,21,11],[22,1,22,11],[23,1,23,2],[23,3,27,3],[23,6,27,6],[23,7,23,11],[24,1,24,2],[24,7,24,11],[25,1,25,2],[25,7,25,11],[26,1,26,2],[26,7,26,11],[27,1,27,2],[27,7,27,11],[29,1,29,2],[29,3,35,3],[29,6,35,6],[29,7,29,11],[30,1,30,2],[30,7,30,11],[31,1,31,2],[31,7,31,11],[32,1,32,2],[32,7,32,11],[33,1,33,2],[33,7,33,11],[34,1,34,2],[34,7,34,11],[35,1,35,2],[35,7,35,11],[36,1,36,11],[37,1,37,2],[37,3,40,3],[37,6,40,6],[37,7,37,11],[38,1,38,2],[38,7,38,11],[39,1,39,2],[39,7,39,11],[40,1,40,2],[40,7,40,11],[41,1,41,11],[42,1,42,2],[42,3,46,3],[42,6,46,6],[42,7,42,11],[43,1,43,2],[43,7,43,11],[44,1,44,2],[44,7,44,11],[45,1,45,2],[45,7,45,11],[46,1,46,2],[46,7,46,11],[47,1,47,2],[47,3,49,3],[47,6,49,6],[47,7,47,11],[48,1,48,2],[48,7,48,11],[49,1,49,2],[49,7,49,11],[50,1,50,3],[50,9,50,11],[51,1,51,3],[51,7,51,9],[51,10,51,11],[54,1,54,11],[56,9,56,11],[52,1,52,3],[52,4,52,5],[52,8,52,9],[53,1,53,3],[53,4,53,5],[53,7,53,9]]}
[null,null,null,null,null,null,null,null,null,null,{"$f":"Fiche_organisateur_N°1!$E$26","v":"IHT 1"}]
[]
[null,"COMMISSION D'UTILISATION TROUPEAUX"]
[null,null,"Epreuve de travail sur Ovins - TRADITIONAL STYLE "]
[null,"ORGANISATEUR :",{"$f":"Fiche_organisateur_N°1!E15","v":0}]
[null,"Lieu :",{"$f":"Fiche_organisateur_N°1!E16","v":0},null,null,null,null,"Date :",{"$f":"Fiche_organisateur_N°1!$E$13","v":0}]
[null,"Contact :",{"$f":"Fiche_organisateur_N°1!E18","v":0}]
[]
[null,"PROPRIETAIRE :",{"$f":"Fiche_organisateur_N°2!C26","v":0},null,null,null,null,"Race et sexe",{"$f":"Fiche_organisateur_N°2!G26","v":0}]
[null,"CONDUCTEUR :",{"$f":"Fiche_organisateur_N°2!D26","v":0},null,null,null,null,"N° FAPAC :",{"$f":"Fiche_organisateur_N°2!K26","v":0}]
[null,"NOM DU CHIEN :",{"$f":"Fiche_organisateur_N°2!E26","v":0},null,null,null,null,"AFFIXE :",{"$f":"Fiche_organisateur_N°2!F26","v":0}]
[null,null,null,null,null,null,null,"N° d'Identification",{"$f":"Fiche_organisateur_N°2!L26","v":0},null,null,null,null,"Contrôle de saisie (sur les onglets 01 à 20 )"]
[]
[null,null,null,null,null,null,null,null,null,null,null,null,null,"Ces colonnes n'apparaissent pas lors de l'impression…"]
[null,"Epreuves                ",null,null,"Pointages /100",null,null,{"$f":"IF(OR('00'!N51<>30,LEFT('00'!H51,9)=\"ATTENTION\")=1,\"NON VALIDE => corriger la feuille 00 ! ! !\",\"Observations\")","v":"Observations"},null,null,null,null,null,"contrôle-1",null,"contrôle-2"]
[null,{"$f":"IF('00'!B16=\"\",\" -\",'00'!B16)","v":" -"}]
[null,{"$f":"IF('00'!B17=\"\",\" -\",'00'!B17)","v":"Sortie de parc ou bergerie / Exit from the pen "},null,{"$f":"IF('00'!D17=\"\",\"\",'00'!D17)","v":20},null,{"$f":"IF('00'!F17=\"\",\"\",'00'!F17)","v":15},{"$f":"SUM(F17:F22)","v":20},null,null,null,null,null,null,{"$f":"IF(B17=\"\",\"\",IF(E17>F17,\"! ? !\",\"OK\"))","v":"OK"},null,{"$f":"IF(AND(B17=\" -\",E17<>0),\"! ? !\",\"OK\")","v":"OK"}]
[null,{"$f":"IF('00'!B18=\"\",\" -\",'00'!B18)","v":" -"},null,null,null,{"$f":"IF('00'!F18=\"\",\"\",'00'!F18)","v":""},null,null,null,null,null,null,null,"OK",null,"OK",null,"Contrôle-1 : Contrôle que les valeurs entrées ne sont pas supérieures"]
[null,{"$f":"IF('00'!B19=\"\",\" -\",'00'!B19)","v":" -"},null,null,null,{"$f":"IF('00'!F19=\"\",\"\",'00'!F19)","v":""},null,null,null,null,null,null,null,"OK",null,"OK",null,"                    aux pointages maxi attribués à chaque épreuve…"]
[null,{"$f":"IF('00'!B20=\"\",\" -\",'00'!B20)","v":" -"},null,null,null,{"$f":"IF('00'!F20=\"\",\"\",'00'!F20)","v":""},null,null,null,null,null,null,null,"OK",null,"OK"]
[null,{"$f":"IF('00'!B21=\"\",\" -\",'00'!B21)","v":" -"},null,null,null,{"$f":"IF('00'!F21=\"\",\"\",'00'!F21)","v":""},null,null,null,null,null,null,null,"OK",null,"OK"]
[null,{"$f":"IF('00'!B22=\"\",\" -\",'00'!B22)","v":"Rentrée du troupeau  / Re-pen"},null,null,null,{"$f":"IF('00'!F22=\"\",\"\",'00'!F22)","v":5},null,null,null,null,null,null,null,"OK",null,"OK"]
[null,{"$f":"IF('00'!B23=\"\",\" -\",'00'!B23)","v":" -"}]
[null,{"$f":"IF('00'!B24=\"\",\" -\",'00'!B24)","v":"Pont/ Bridge"},null,{"$f":"IF('00'!D24=\"\",\"\",'00'!D24)","v":15},null,{"$f":"IF('00'!F24=\"\",\"\",'00'!F24)","v":5},{"$f":"SUM(F24:F28)","v":15},null,null,null,null,null,null,{"$f":"IF(B24=\"\",\"\",IF(E24>F24,\"! ? !\",\"OK\"))","v":"OK"},null,{"$f":"IF(AND(B24=\" -\",E24<>0),\"! ? !\",\"OK\")","v":"OK"}]
[null,{"$f":"IF('00'!B25=\"\",\" -\",'00'!B25)","v":"obstacle A"},null,null,null,{"$f":"IF('00'!F25=\"\",\"\",'00'!F25)","v":10},null,null,null,null,null,null,null,{"$f":"IF(B25=\"\",\"\",IF(E25>F25,\"! ? !\",\"OK\"))","v":"OK"},null,{"$f":"IF(AND(B25=\" -\",E25<>0),\"! ? !\",\"OK\")","v":"OK"}]
[null,{"$f":"IF('00'!B26=\"\",\" -\",'00'!B26)","v":"Qbstacle B"},null,null,null,{"$f":"IF('00'!F26=\"\",\"\",'00'!F26)","v":""},null,null,null,null,null,null,null,{"$f":"IF(B26=\"\",\"\",IF(E26>F26,\"! ? !\",\"OK\"))","v":"OK"},null,{"$f":"IF(AND(B26=\" -\",E26<>0),\"! ? !\",\"OK\")","v":"OK"}]
[null,{"$f":"IF('00'!B27=\"\",\" -\",'00'!B27)","v":"Obstacle C"},null,null,null,{"$f":"IF('00'!F27=\"\",\"\",'00'!F27)","v":""},null,null,null,null,null,null,null,{"$f":"IF(B27=\"\",\"\",IF(E27>F27,\"! ? !\",\"OK\"))","v":"OK"},null,{"$f":"IF(AND(B27=\" -\",E27<>0),\"! ? !\",\"OK\")","v":"OK"}]
[null,{"$f":"IF('00'!B28=\"\",\" -\",'00'!B28)","v":" -"},null,null,null,{"$f":"IF('00'!F28=\"\",\"\",'00'!F28)","v":""},null,null,null,null,null,null,null,{"$f":"IF(B28=\"\",\"\",IF(E28>F28,\"! ? !\",\"OK\"))","v":"OK"},null,{"$f":"IF(AND(B28=\" -\",E28<>0),\"! ? !\",\"OK\")","v":"OK"}]
[null,{"$f":"IF('00'!B29=\"\",\" -\",'00'!B29)","v":" -"}]
[null,{"$f":"IF('00'!B30=\"\",\" -\",'00'!B30)","v":"Conduite /Moving"},null,{"$f":"IF('00'!D30=\"\",\"\",'00'!D30)","v":45},null,{"$f":"IF('00'!F30=\"\",\"\",'00'!F30)","v":20},{"$f":"SUM(F30:F36)","v":45},null,null,null,null,null,null,{"$f":"IF(B30=\"\",\"\",IF(E30>F30,\"! ? !\",\"OK\"))","v":"OK"},null,{"$f":"IF(AND(B30=\" -\",E30<>0),\"! ? !\",\"OK\")","v":"OK"},null,"Contrôle-2 : Contrôle que les lignes sans épreuve ne contiennent pas de note"]
[null,{"$f":"IF('00'!B31=\"\",\" -\",'00'!B31)","v":"Pâturage / Grazing"},null,null,null,{"$f":"IF('00'!F31=\"\",\"\",'00'!F31)","v":20},null,null,null,null,null,null,null,"OK",null,"OK"]
[null,{"$f":"IF('00'!B32=\"\",\" -\",'00'!B32)","v":"Prise de brebis/ catching sheep and holding a sheep "},null,null,null,{"$f":"IF('00'!F32=\"\",\"\",'00'!F32)","v":5},null,null,null,null,null,null,null,"OK",null,"OK"]
[null,{"$f":"IF('00'!B33=\"\",\" -\",'00'!B33)","v":"Protection de cultures/ Crop protection "},null,null,null,{"$f":"IF('00'!F33=\"\",\"\",'00'!F33)","v":""},null,null,null,null,null,null,null,"OK",null,"OK"]
[null,{"$f":"IF('00'!B34=\"\",\" -\",'00'!B34)","v":"Traffic/ Vehicule "},null,null,null,{"$f":"IF('00'!F34=\"\",\"\",'00'!F34)","v":""},null,null,null,null,null,null,null,"OK",null,"OK"]
[null,{"$f":"IF('00'!B35=\"\",\" -\",'00'!B35)","v":" -"},null,null,null,{"$f":"IF('00'!F35=\"\",\"\",'00'!F35)","v":""},null,null,null,null,null,null,null,"OK",null,"OK"]
[null,{"$f":"IF('00'!B36=\"\",\" -\",'00'!B36)","v":" -"},null,null,null,{"$f":"IF('00'!F36=\"\",\"\",'00'!F36)","v":""},null,null,null,null,null,null,null,"OK",null,"OK"]
[null,{"$f":"IF('00'!B37=\"\",\" -\",'00'!B37)","v":" -"}]
[null,{"$f":"IF('00'!B38=\"\",\" -\",'00'!B38)","v":"Arrêt du troupeau / Stop 1"},null,{"$f":"IF('00'!D38=\"\",\"\",'00'!D38)","v":10},null,{"$f":"IF('00'!F38=\"\",\"\",'00'!F38)","v":10},{"$f":"SUM(F38:F41)","v":10},null,null,null,null,null,null,{"$f":"IF(B38=\"\",\"\",IF(E38>F38,\"! ? !\",\"OK\"))","v":"OK"},null,{"$f":"IF(AND(B38=\" -\",E38<>0),\"! ? !\",\"OK\")","v":"OK"}]
[null,{"$f":"IF('00'!B39=\"\",\" -\",'00'!B39)","v":"Arrêt du troupeau / Stop 2"},null,null,null,{"$f":"IF('00'!F39=\"\",\"\",'00'!F39)","v":""},null,null,null,null,null,null,null,{"$f":"IF(B39=\"\",\"\",IF(E39>F39,\"! ? !\",\"OK\"))","v":"OK"},null,{"$f":"IF(AND(B39=\" -\",E39<>0),\"! ? !\",\"OK\")","v":"OK"}]
[null,{"$f":"IF('00'!B40=\"\",\" -\",'00'!B40)","v":"Arrêt du troupeau / Stop 3"},null,null,null,{"$f":"IF('00'!F40=\"\",\"\",'00'!F40)","v":""},null,null,null,null,null,null,null,{"$f":"IF(B40=\"\",\"\",IF(E40>F40,\"! ? !\",\"OK\"))","v":"OK"},null,{"$f":"IF(AND(B40=\" -\",E40<>0),\"! ? !\",\"OK\")","v":"OK"}]
[null,{"$f":"IF('00'!B41=\"\",\" -\",'00'!B41)","v":" -"},null,null,null,{"$f":"IF('00'!F41=\"\",\"\",'00'!F41)","v":""},null,null,null,null,null,null,null,{"$f":"IF(B41=\"\",\"\",IF(E41>F41,\"! ? !\",\"OK\"))","v":"OK"},null,{"$f":"IF(AND(B41=\" -\",E41<>0),\"! ? !\",\"OK\")","v":"OK"}]
[null,{"$f":"IF('00'!B42=\"\",\" -\",'00'!B42)","v":" -"}]
[null,{"$f":"IF('00'!B43=\"\",\" -\",'00'!B43)","v":"Aptitude naturelle / Natural ability "},null,{"$f":"IF('00'!D43=\"\",\"\",'00'!D43)","v":10},null,{"$f":"IF('00'!F43=\"\",\"\",'00'!F43)","v":3},{"$f":"SUM(F43:F47)","v":10},null,null,null,null,null,null,{"$f":"IF(B43=\"\",\"\",IF(E43>F43,\"! ? !\",\"OK\"))","v":"OK"},null,{"$f":"IF(AND(B43=\" -\",E43<>0),\"! ? !\",\"OK\")","v":"OK"}]
[null,{"$f":"IF('00'!B44=\"\",\" -\",'00'!B44)","v":"Absence d’agressivité/ gentleness "},null,null,null,{"$f":"IF('00'!F44=\"\",\"\",'00'!F44)","v":2},null,null,null,null,null,null,null,"OK",null,"OK"]
[null,{"$f":"IF('00'!B45=\"\",\" -\",'00'!B45)","v":"Intelligence d’exécution/ Intelligence of execution  "},null,null,null,{"$f":"IF('00'!F45=\"\",\"\",'00'!F45)","v":2},null,null,null,null,null,null,null,"OK",null,"OK"]
[null,{"$f":"IF('00'!B46=\"\",\" -\",'00'!B46)","v":"Obéissance / Obedience "},null,null,null,{"$f":"IF('00'!F46=\"\",\"\",'00'!F46)","v":3},null,null,null,null,null,null,null,"OK",null,"OK"]
[null,{"$f":"IF('00'!B47=\"\",\" -\",'00'!B47)","v":" -"},null,null,null,{"$f":"IF('00'!F47=\"\",\"\",'00'!F47)","v":""},null,null,null,null,null,null,null,"OK",null,"OK"]
[null,{"$f":"IF('00'!B48=\"\",\" -\",'00'!B48)","v":" -"},null,{"$f":"IF('00'!D48=\"\",\"\",'00'!D48)","v":""},null,{"$f":"IF('00'!F48=\"\",\"\",'00'!F48)","v":""},{"$f":"SUM(F48:F50)","v":0},null,null,null,null,null,null,"OK",null,"OK"]
[null,{"$f":"IF('00'!B49=\"\",\" -\",'00'!B49)","v":" -"},null,null,null,{"$f":"IF('00'!F49=\"\",\"\",'00'!F49)","v":""},null,null,null,null,null,null,null,"OK",null,"OK"," "]
[null,{"$f":"IF('00'!B50=\"\",\" -\",'00'!B50)","v":" -"},null,null,null,{"$f":"IF('00'!F50=\"\",\"\",'00'!F50)","v":""},null,null,null,null,null,null,null,"OK",null,"OK"]
[null,"Pointage du Travail  ==>  ",null,null,{"$f":"SUM(E17:E50)","v":0},{"$f":"SUM(F17:F50)","v":100},null,null,"Temps = "]
[null,"Pénalités Générales :\n(chiffre négatif)    .",null,null,null,null,null,"Informations sur les pénalités générales :\n   \n   \n   ",null,null,"Classement :",null,null,{"$f":"IF(E52=\"\",\"\",IF(E52>0,\"ATTENTION : 'Pénalité Générales' doit être un nombre négatif ! \",\"OK\"))","v":""}]
[null,"TOTAL GENERAL =",null,null,{"$f":"IF(COUNT(E17:E50)=0,\"-\",E51+E52)","v":"-"},null,null,"Qualificatif :",{"$f":"IF(E53=\"-\",\"-\",IF(E53>89.9999,\"EXCELLENT\",IF(E53>79.9999,\"TRES BON\",IF(E53>69.999,\"BON\",IF(E53>59.999,\"Satisfaisant\",IF(E53>0.1,\"insuffisant \",\"éliminé \"))))))","v":"-"},null,{"$f":"Fiche_organisateur_N°2!P26","v":"X"},{"$f":"'Rapport de Concours'!D40","v":0}]
[null,"CACITR / RCACITR / CACTR / RCACTR :",null,null," -",null,null," <== sur décision du juge "]
[null,"Observations :  ",null,null,null,null,null,null,null,null,null,null,{"$f":"M51+M52","v":0}]
[]
[null,null,null,null,null,null,null,null,"Le Juge :",{"$f":"Fiche_organisateur_N°1!E28","v":0}]

{"sheet":"11","index":18,"n_rows":57,"n_cols":18,"rows_kept":57,"cut":false,"hidden":false,"merged":[[10,8,10,9],[0,10,0,11],[2,1,2,11],[8,8,8,9],[9,8,9,9],[3,2,3,9],[11,8,11,9],[14,4,14,5],[14,7,14,11],[15,1,15,11],[16,1,16,2],[16,3,21,3],[16,6,21,6],[16,7,16,11],[17,1,17,2],[17,7,17,11],[18,1,18,2],[18,7,18,11],[19,1,19,2],[19,7,19,11],[20,1,20,2],[20,7,20,11],[28,1,28,11],[21,1,21,2],[21,7,21,11],[22,1,22,11],[23,1,23,2],[23,3,27,3],[23,6,27,6],[23,7,23,11],[24,1,24,2],[24,7,24,11],[25,1,25,2],[25,7,25,11],[26,1,26,2],[26,7,26,11],[27,1,27,2],[27,7,27,11],[29,1,29,2],[29,3,35,3],[29,6,35,6],[29,7,29,11],[30,1,30,2],[30,7,30,11],[31,1,31,2],[31,7,31,11],[32,1,32,2],[32,7,32,11],[33,1,33,2],[33,7,33,11],[34,1,34,2],[34,7,34,11],[35,1,35,2],[35,7,35,11],[36,1,36,11],[37,1,37,2],[37,3,40,3],[37,6,40,6],[37,7,37,11],[38,1,38,2],[38,7,38,11],[39,1,39,2],[39,7,39,11],[40,1,40,2],[40,7,40,11],[41,1,41,11],[42,1,42,2],[42,3,46,3],[42,6,46,6],[42,7,42,11],[43,1,43,2],[43,7,43,11],[44,1,44,2],[44,7,44,11],[45,1,45,2],[45,7,45,11],[46,1,46,2],[46,7,46,11],[47,1,47,2],[47,3,49,3],[47,6,49,6],[47,7,47,11],[48,1,48,2],[48,7,48,11],[49,1,49,2],[49,7,49,11],[50,1,50,3],[50,9,50,11],[51,1,51,3],[51,7,51,9],[51,10,51,11],[54,1,54,11],[56,9,56,11],[52,1,52,3],[52,4,52,5],[52,8,52,9],[53,1,53,3],[53,4,53,5],[53,7,53,9]]}
[null,null,null,null,null,null,null,null,null,null,{"$f":"Fiche_organisateur_N°1!$E$26","v":"IHT 1"}]
[]
[null,"COMMISSION D'UTILISATION TROUPEAUX"]
[null,null,"Epreuve de travail sur Ovins - TRADITIONAL STYLE "]
[null,"ORGANISATEUR :",{"$f":"Fiche_organisateur_N°1!E15","v":0}]
[null,"Lieu :",{"$f":"Fiche_organisateur_N°1!E16","v":0},null,null,null,null,"Date :",{"$f":"Fiche_organisateur_N°1!$E$13","v":0}]
[null,"Contact :",{"$f":"Fiche_organisateur_N°1!E18","v":0}]
[]
[null,"PROPRIETAIRE :",{"$f":"Fiche_organisateur_N°2!C27","v":0},null,null,null,null,"Race et sexe",{"$f":"Fiche_organisateur_N°2!G27","v":0}]
[null,"CONDUCTEUR :",{"$f":"Fiche_organisateur_N°2!D27","v":0},null,null,null,null,"N° FAPAC :",{"$f":"Fiche_organisateur_N°2!K27","v":0}]
[null,"NOM DU CHIEN :",{"$f":"Fiche_organisateur_N°2!E27","v":0},null,null,null,null,"AFFIXE :",{"$f":"Fiche_organisateur_N°2!F27","v":0}]
[null,null,null,null,null,null,null,"N° d'Identification",{"$f":"Fiche_organisateur_N°2!L27","v":0},null,null,null,null,"Contrôle de saisie (sur les onglets 01 à 20 )"]
[]
[null,null,null,null,null,null,null,null,null,null,null,null,null,"Ces colonnes n'apparaissent pas lors de l'impression…"]
[null,"Epreuves                ",null,null,"Pointages /100",null,null,{"$f":"IF(OR('00'!N51<>30,LEFT('00'!H51,9)=\"ATTENTION\")=1,\"NON VALIDE => corriger la feuille 00 ! ! !\",\"Observations\")","v":"Observations"},null,null,null,null,null,"contrôle-1",null,"contrôle-2"]
[null,{"$f":"IF('00'!B16=\"\",\" -\",'00'!B16)","v":" -"}]
[null,{"$f":"IF('00'!B17=\"\",\" -\",'00'!B17)","v":"Sortie de parc ou bergerie / Exit from the pen "},null,{"$f":"IF('00'!D17=\"\",\"\",'00'!D17)","v":20},null,{"$f":"IF('00'!F17=\"\",\"\",'00'!F17)","v":15},{"$f":"SUM(F17:F22)","v":20},null,null,null,null,null,null,{"$f":"IF(B17=\"\",\"\",IF(E17>F17,\"! ? !\",\"OK\"))","v":"OK"},null,{"$f":"IF(AND(B17=\" -\",E17<>0),\"! ? !\",\"OK\")","v":"OK"}]
[null,{"$f":"IF('00'!B18=\"\",\" -\",'00'!B18)","v":" -"},null,null,null,{"$f":"IF('00'!F18=\"\",\"\",'00'!F18)","v":""},null,null,null,null,null,null,null,"OK",null,"OK",null,"Contrôle-1 : Contrôle que les valeurs entrées ne sont pas supérieures"]
[null,{"$f":"IF('00'!B19=\"\",\" -\",'00'!B19)","v":" -"},null,null,null,{"$f":"IF('00'!F19=\"\",\"\",'00'!F19)","v":""},null,null,null,null,null,null,null,"OK",null,"OK",null,"                    aux pointages maxi attribués à chaque épreuve…"]
[null,{"$f":"IF('00'!B20=\"\",\" -\",'00'!B20)","v":" -"},null,null,null,{"$f":"IF('00'!F20=\"\",\"\",'00'!F20)","v":""},null,null,null,null,null,null,null,"OK",null,"OK"]
[null,{"$f":"IF('00'!B21=\"\",\" -\",'00'!B21)","v":" -"},null,null,null,{"$f":"IF('00'!F21=\"\",\"\",'00'!F21)","v":""},null,null,null,null,null,null,null,"OK",null,"OK"]
[null,{"$f":"IF('00'!B22=\"\",\" -\",'00'!B22)","v":"Rentrée du troupeau  / Re-pen"},null,null,null,{"$f":"IF('00'!F22=\"\",\"\",'00'!F22)","v":5},null,null,null,null,null,null,null,"OK",null,"OK"]
[null,{"$f":"IF('00'!B23=\"\",\" -\",'00'!B23)","v":" -"}]
[null,{"$f":"IF('00'!B24=\"\",\" -\",'00'!B24)","v":"Pont/ Bridge"},null,{"$f":"IF('00'!D24=\"\",\"\",'00'!D24)","v":15},null,{"$f":"IF('00'!F24=\"\",\"\",'00'!F24)","v":5},{"$f":"SUM(F24:F28)","v":15},null,null,null,null,null,null,{"$f":"IF(B24=\"\",\"\",IF(E24>F24,\"! ? !\",\"OK\"))","v":"OK"},null,{"$f":"IF(AND(B24=\" -\",E24<>0),\"! ? !\",\"OK\")","v":"OK"}]
[null,{"$f":"IF('00'!B25=\"\",\" -\",'00'!B25)","v":"obstacle A"},null,null,null,{"$f":"IF('00'!F25=\"\",\"\",'00'!F25)","v":10},null,null,null,null,null,null,null,{"$f":"IF(B25=\"\",\"\",IF(E25>F25,\"! ? !\",\"OK\"))","v":"OK"},null,{"$f":"IF(AND(B25=\" -\",E25<>0),\"! ? !\",\"OK\")","v":"OK"}]
[null,{"$f":"IF('00'!B26=\"\",\" -\",'00'!B26)","v":"Qbstacle B"},null,null,null,{"$f":"IF('00'!F26=\"\",\"\",'00'!F26)","v":""},null,null,null,null,null,null,null,{"$f":"IF(B26=\"\",\"\",IF(E26>F26,\"! ? !\",\"OK\"))","v":"OK"},null,{"$f":"IF(AND(B26=\" -\",E26<>0),\"! ? !\",\"OK\")","v":"OK"}]
[null,{"$f":"IF('00'!B27=\"\",\" -\",'00'!B27)","v":"Obstacle C"},null,null,null,{"$f":"IF('00'!F27=\"\",\"\",'00'!F27)","v":""},null,null,null,null,null,null,null,{"$f":"IF(B27=\"\",\"\",IF(E27>F27,\"! ? !\",\"OK\"))","v":"OK"},null,{"$f":"IF(AND(B27=\" -\",E27<>0),\"! ? !\",\"OK\")","v":"OK"}]
[null,{"$f":"IF('00'!B28=\"\",\" -\",'00'!B28)","v":" -"},null,null,null,{"$f":"IF('00'!F28=\"\",\"\",'00'!F28)","v":""},null,null,null,null,null,null,null,{"$f":"IF(B28=\"\",\"\",IF(E28>F28,\"! ? !\",\"OK\"))","v":"OK"},null,{"$f":"IF(AND(B28=\" -\",E28<>0),\"! ? !\",\"OK\")","v":"OK"}]
[null,{"$f":"IF('00'!B29=\"\",\" -\",'00'!B29)","v":" -"}]
[null,{"$f":"IF('00'!B30=\"\",\" -\",'00'!B30)","v":"Conduite /Moving"},null,{"$f":"IF('00'!D30=\"\",\"\",'00'!D30)","v":45},null,{"$f":"IF('00'!F30=\"\",\"\",'00'!F30)","v":20},{"$f":"SUM(F30:F36)","v":45},null,null,null,null,null,null,{"$f":"IF(B30=\"\",\"\",IF(E30>F30,\"! ? !\",\"OK\"))","v":"OK"},null,{"$f":"IF(AND(B30=\" -\",E30<>0),\"! ? !\",\"OK\")","v":"OK"},null,"Contrôle-2 : Contrôle que les lignes sans épreuve ne contiennent pas de note"]
[null,{"$f":"IF('00'!B31=\"\",\" -\",'00'!B31)","v":"Pâturage / Grazing"},null,null,null,{"$f":"IF('00'!F31=\"\",\"\",'00'!F31)","v":20},null,null,null,null,null,null,null,"OK",null,"OK"]
[null,{"$f":"IF('00'!B32=\"\",\" -\",'00'!B32)","v":"Prise de brebis/ catching sheep and holding a sheep "},null,null,null,{"$f":"IF('00'!F32=\"\",\"\",'00'!F32)","v":5},null,null,null,null,null,null,null,"OK",null,"OK"]
[null,{"$f":"IF('00'!B33=\"\",\" -\",'00'!B33)","v":"Protection de cultures/ Crop protection "},null,null,null,{"$f":"IF('00'!F33=\"\",\"\",'00'!F33)","v":""},null,null,null,null,null,null,null,"OK",null,"OK"]
[null,{"$f":"IF('00'!B34=\"\",\" -\",'00'!B34)","v":"Traffic/ Vehicule "},null,null,null,{"$f":"IF('00'!F34=\"\",\"\",'00'!F34)","v":""},null,null,null,null,null,null,null,"OK",null,"OK"]
[null,{"$f":"IF('00'!B35=\"\",\" -\",'00'!B35)","v":" -"},null,null,null,{"$f":"IF('00'!F35=\"\",\"\",'00'!F35)","v":""},null,null,null,null,null,null,null,"OK",null,"OK"]
[null,{"$f":"IF('00'!B36=\"\",\" -\",'00'!B36)","v":" -"},null,null,null,{"$f":"IF('00'!F36=\"\",\"\",'00'!F36)","v":""},null,null,null,null,null,null,null,"OK",null,"OK"]
[null,{"$f":"IF('00'!B37=\"\",\" -\",'00'!B37)","v":" -"}]
[null,{"$f":"IF('00'!B38=\"\",\" -\",'00'!B38)","v":"Arrêt du troupeau / Stop 1"},null,{"$f":"IF('00'!D38=\"\",\"\",'00'!D38)","v":10},null,{"$f":"IF('00'!F38=\"\",\"\",'00'!F38)","v":10},{"$f":"SUM(F38:F41)","v":10},null,null,null,null,null,null,{"$f":"IF(B38=\"\",\"\",IF(E38>F38,\"! ? !\",\"OK\"))","v":"OK"},null,{"$f":"IF(AND(B38=\" -\",E38<>0),\"! ? !\",\"OK\")","v":"OK"}]
[null,{"$f":"IF('00'!B39=\"\",\" -\",'00'!B39)","v":"Arrêt du troupeau / Stop 2"},null,null,null,{"$f":"IF('00'!F39=\"\",\"\",'00'!F39)","v":""},null,null,null,null,null,null,null,{"$f":"IF(B39=\"\",\"\",IF(E39>F39,\"! ? !\",\"OK\"))","v":"OK"},null,{"$f":"IF(AND(B39=\" -\",E39<>0),\"! ? !\",\"OK\")","v":"OK"}]
[null,{"$f":"IF('00'!B40=\"\",\" -\",'00'!B40)","v":"Arrêt du troupeau / Stop 3"},null,null,null,{"$f":"IF('00'!F40=\"\",\"\",'00'!F40)","v":""},null,null,null,null,null,null,null,{"$f":"IF(B40=\"\",\"\",IF(E40>F40,\"! ? !\",\"OK\"))","v":"OK"},null,{"$f":"IF(AND(B40=\" -\",E40<>0),\"! ? !\",\"OK\")","v":"OK"}]
[null,{"$f":"IF('00'!B41=\"\",\" -\",'00'!B41)","v":" -"},null,null,null,{"$f":"IF('00'!F41=\"\",\"\",'00'!F41)","v":""},null,null,null,null,null,null,null,{"$f":"IF(B41=\"\",\"\",IF(E41>F41,\"! ? !\",\"OK\"))","v":"OK"},null,{"$f":"IF(AND(B41=\" -\",E41<>0),\"! ? !\",\"OK\")","v":"OK"}]
[null,{"$f":"IF('00'!B42=\"\",\" -\",'00'!B42)","v":" -"}]
[null,{"$f":"IF('00'!B43=\"\",\" -\",'00'!B43)","v":"Aptitude naturelle / Natural ability "},null,{"$f":"IF('00'!D43=\"\",\"\",'00'!D43)","v":10},null,{"$f":"IF('00'!F43=\"\",\"\",'00'!F43)","v":3},{"$f":"SUM(F43:F47)","v":10},null,null,null,null,null,null,{"$f":"IF(B43=\"\",\"\",IF(E43>F43,\"! ? !\",\"OK\"))","v":"OK"},null,{"$f":"IF(AND(B43=\" -\",E43<>0),\"! ? !\",\"OK\")","v":"OK"}]
[null,{"$f":"IF('00'!B44=\"\",\" -\",'00'!B44)","v":"Absence d’agressivité/ gentleness "},null,null,null,{"$f":"IF('00'!F44=\"\",\"\",'00'!F44)","v":2},null,null,null,null,null,null,null,"OK",null,"OK"]
[null,{"$f":"IF('00'!B45=\"\",\" -\",'00'!B45)","v":"Intelligence d’exécution/ Intelligence of execution  "},null,null,null,{"$f":"IF('00'!F45=\"\",\"\",'00'!F45)","v":2},null,null,null,null,null,null,null,"OK",null,"OK"]
[null,{"$f":"IF('00'!B46=\"\",\" -\",'00'!B46)","v":"Obéissance / Obedience "},null,null,null,{"$f":"IF('00'!F46=\"\",\"\",'00'!F46)","v":3},null,null,null,null,null,null,null,"OK",null,"OK"]
[null,{"$f":"IF('00'!B47=\"\",\" -\",'00'!B47)","v":" -"},null,null,null,{"$f":"IF('00'!F47=\"\",\"\",'00'!F47)","v":""},null,null,null,null,null,null,null,"OK",null,"OK"]
[null,{"$f":"IF('00'!B48=\"\",\" -\",'00'!B48)","v":" -"},null,{"$f":"IF('00'!D48=\"\",\"\",'00'!D48)","v":""},null,{"$f":"IF('00'!F48=\"\",\"\",'00'!F48)","v":""},{"$f":"SUM(F48:F50)","v":0},null,null,null,null,null,null,"OK",null,"OK"]
[null,{"$f":"IF('00'!B49=\"\",\" -\",'00'!B49)","v":" -"},null,null,null,{"$f":"IF('00'!F49=\"\",\"\",'00'!F49)","v":""},null,null,null,null,null,null,null,"OK",null,"OK"," "]
[null,{"$f":"IF('00'!B50=\"\",\" -\",'00'!B50)","v":" -"},null,null,null,{"$f":"IF('00'!F50=\"\",\"\",'00'!F50)","v":""},null,null,null,null,null,null,null,"OK",null,"OK"]
[null,"Pointage du Travail  ==>  ",null,null,{"$f":"SUM(E17:E50)","v":0},{"$f":"SUM(F17:F50)","v":100},null,null,"Temps = "]
[null,"Pénalités Générales :\n(chiffre négatif)    .",null,null,null,null,null,"Informations sur les pénalités générales :\n   \n   \n   ",null,null,"Classement :",null,null,{"$f":"IF(E52=\"\",\"\",IF(E52>0,\"ATTENTION : 'Pénalité Générales' doit être un nombre négatif ! \",\"OK\"))","v":""}]
[null,"TOTAL GENERAL =",null,null,{"$f":"IF(COUNT(E17:E50)=0,\"-\",E51+E52)","v":"-"},null,null,"Qualificatif :",{"$f":"IF(E53=\"-\",\"-\",IF(E53>89.9999,\"EXCELLENT\",IF(E53>79.9999,\"TRES BON\",IF(E53>69.999,\"BON\",IF(E53>59.999,\"Satisfaisant\",IF(E53>0.1,\"insuffisant \",\"éliminé \"))))))","v":"-"},null,{"$f":"Fiche_organisateur_N°2!P27","v":"X"},{"$f":"'Rapport de Concours'!D40","v":0}]
[null,"CACITR / RCACITR / CACTR / RCACTR :",null,null," -",null,null," <== sur décision du juge "]
[null,"Observations :  ",null,null,null,null,null,null,null,null,null,null,{"$f":"M51+M52","v":0}]
[]
[null,null,null,null,null,null,null,null,"Le Juge :",{"$f":"Fiche_organisateur_N°1!E28","v":0}]

{"sheet":"12","index":19,"n_rows":57,"n_cols":18,"rows_kept":57,"cut":false,"hidden":false,"merged":[[10,8,10,9],[0,10,0,11],[2,1,2,11],[8,8,8,9],[9,8,9,9],[3,2,3,9],[11,8,11,9],[14,4,14,5],[14,7,14,11],[15,1,15,11],[16,1,16,2],[16,3,21,3],[16,6,21,6],[16,7,16,11],[17,1,17,2],[17,7,17,11],[18,1,18,2],[18,7,18,11],[19,1,19,2],[19,7,19,11],[20,1,20,2],[20,7,20,11],[28,1,28,11],[21,1,21,2],[21,7,21,11],[22,1,22,11],[23,1,23,2],[23,3,27,3],[23,6,27,6],[23,7,23,11],[24,1,24,2],[24,7,24,11],[25,1,25,2],[25,7,25,11],[26,1,26,2],[26,7,26,11],[27,1,27,2],[27,7,27,11],[29,1,29,2],[29,3,35,3],[29,6,35,6],[29,7,29,11],[30,1,30,2],[30,7,30,11],[31,1,31,2],[31,7,31,11],[32,1,32,2],[32,7,32,11],[33,1,33,2],[33,7,33,11],[34,1,34,2],[34,7,34,11],[35,1,35,2],[35,7,35,11],[36,1,36,11],[37,1,37,2],[37,3,40,3],[37,6,40,6],[37,7,37,11],[38,1,38,2],[38,7,38,11],[39,1,39,2],[39,7,39,11],[40,1,40,2],[40,7,40,11],[41,1,41,11],[42,1,42,2],[42,3,46,3],[42,6,46,6],[42,7,42,11],[43,1,43,2],[43,7,43,11],[44,1,44,2],[44,7,44,11],[45,1,45,2],[45,7,45,11],[46,1,46,2],[46,7,46,11],[47,1,47,2],[47,3,49,3],[47,6,49,6],[47,7,47,11],[48,1,48,2],[48,7,48,11],[49,1,49,2],[49,7,49,11],[50,1,50,3],[50,9,50,11],[51,1,51,3],[51,7,51,9],[51,10,51,11],[54,1,54,11],[56,9,56,11],[52,1,52,3],[52,4,52,5],[52,8,52,9],[53,1,53,3],[53,4,53,5],[53,7,53,9]]}
[null,null,null,null,null,null,null,null,null,null,{"$f":"Fiche_organisateur_N°1!$E$26","v":"IHT 1"}]
[]
[null,"COMMISSION D'UTILISATION TROUPEAUX"]
[null,null,"Epreuve de travail sur Ovins - TRADITIONAL STYLE "]
[null,"ORGANISATEUR :",{"$f":"Fiche_organisateur_N°1!E15","v":0}]
[null,"Lieu :",{"$f":"Fiche_organisateur_N°1!E16","v":0},null,null,null,null,"Date :",{"$f":"Fiche_organisateur_N°1!$E$13","v":0}]
[null,"Contact :",{"$f":"Fiche_organisateur_N°1!E18","v":0}]
[]
[null,"PROPRIETAIRE :",{"$f":"Fiche_organisateur_N°2!C28","v":0},null,null,null,null,"Race et sexe",{"$f":"Fiche_organisateur_N°2!G28","v":0}]
[null,"CONDUCTEUR :",{"$f":"Fiche_organisateur_N°2!D28","v":0},null,null,null,null,"N° FAPAC :",{"$f":"Fiche_organisateur_N°2!K28","v":0}]
[null,"NOM DU CHIEN :",{"$f":"Fiche_organisateur_N°2!E28","v":0},null,null,null,null,"AFFIXE :",{"$f":"Fiche_organisateur_N°2!F28","v":0}]
[null,null,null,null,null,null,null,"N° d'Identification",{"$f":"Fiche_organisateur_N°2!L28","v":0},null,null,null,null,"Contrôle de saisie (sur les onglets 01 à 20 )"]
[]
[null,null,null,null,null,null,null,null,null,null,null,null,null,"Ces colonnes n'apparaissent pas lors de l'impression…"]
[null,"Epreuves                ",null,null,"Pointages /100",null,null,{"$f":"IF(OR('00'!N51<>30,LEFT('00'!H51,9)=\"ATTENTION\")=1,\"NON VALIDE => corriger la feuille 00 ! ! !\",\"Observations\")","v":"Observations"},null,null,null,null,null,"contrôle-1",null,"contrôle-2"]
[null,{"$f":"IF('00'!B16=\"\",\" -\",'00'!B16)","v":" -"}]
[null,{"$f":"IF('00'!B17=\"\",\" -\",'00'!B17)","v":"Sortie de parc ou bergerie / Exit from the pen "},null,{"$f":"IF('00'!D17=\"\",\"\",'00'!D17)","v":20},null,{"$f":"IF('00'!F17=\"\",\"\",'00'!F17)","v":15},{"$f":"SUM(F17:F22)","v":20},null,null,null,null,null,null,{"$f":"IF(B17=\"\",\"\",IF(E17>F17,\"! ? !\",\"OK\"))","v":"OK"},null,{"$f":"IF(AND(B17=\" -\",E17<>0),\"! ? !\",\"OK\")","v":"OK"}]
[null,{"$f":"IF('00'!B18=\"\",\" -\",'00'!B18)","v":" -"},null,null,null,{"$f":"IF('00'!F18=\"\",\"\",'00'!F18)","v":""},null,null,null,null,null,null,null,"OK",null,"OK",null,"Contrôle-1 : Contrôle que les valeurs entrées ne sont pas supérieures"]
[null,{"$f":"IF('00'!B19=\"\",\" -\",'00'!B19)","v":" -"},null,null,null,{"$f":"IF('00'!F19=\"\",\"\",'00'!F19)","v":""},null,null,null,null,null,null,null,"OK",null,"OK",null,"                    aux pointages maxi attribués à chaque épreuve…"]
[null,{"$f":"IF('00'!B20=\"\",\" -\",'00'!B20)","v":" -"},null,null,null,{"$f":"IF('00'!F20=\"\",\"\",'00'!F20)","v":""},null,null,null,null,null,null,null,"OK",null,"OK"]
[null,{"$f":"IF('00'!B21=\"\",\" -\",'00'!B21)","v":" -"},null,null,null,{"$f":"IF('00'!F21=\"\",\"\",'00'!F21)","v":""},null,null,null,null,null,null,null,"OK",null,"OK"]
[null,{"$f":"IF('00'!B22=\"\",\" -\",'00'!B22)","v":"Rentrée du troupeau  / Re-pen"},null,null,null,{"$f":"IF('00'!F22=\"\",\"\",'00'!F22)","v":5},null,null,null,null,null,null,null,"OK",null,"OK"]
[null,{"$f":"IF('00'!B23=\"\",\" -\",'00'!B23)","v":" -"}]
[null,{"$f":"IF('00'!B24=\"\",\" -\",'00'!B24)","v":"Pont/ Bridge"},null,{"$f":"IF('00'!D24=\"\",\"\",'00'!D24)","v":15},null,{"$f":"IF('00'!F24=\"\",\"\",'00'!F24)","v":5},{"$f":"SUM(F24:F28)","v":15},null,null,null,null,null,null,{"$f":"IF(B24=\"\",\"\",IF(E24>F24,\"! ? !\",\"OK\"))","v":"OK"},null,{"$f":"IF(AND(B24=\" -\",E24<>0),\"! ? !\",\"OK\")","v":"OK"}]
[null,{"$f":"IF('00'!B25=\"\",\" -\",'00'!B25)","v":"obstacle A"},null,null,null,{"$f":"IF('00'!F25=\"\",\"\",'00'!F25)","v":10},null,null,null,null,null,null,null,{"$f":"IF(B25=\"\",\"\",IF(E25>F25,\"! ? !\",\"OK\"))","v":"OK"},null,{"$f":"IF(AND(B25=\" -\",E25<>0),\"! ? !\",\"OK\")","v":"OK"}]
[null,{"$f":"IF('00'!B26=\"\",\" -\",'00'!B26)","v":"Qbstacle B"},null,null,null,{"$f":"IF('00'!F26=\"\",\"\",'00'!F26)","v":""},null,null,null,null,null,null,null,{"$f":"IF(B26=\"\",\"\",IF(E26>F26,\"! ? !\",\"OK\"))","v":"OK"},null,{"$f":"IF(AND(B26=\" -\",E26<>0),\"! ? !\",\"OK\")","v":"OK"}]
[null,{"$f":"IF('00'!B27=\"\",\" -\",'00'!B27)","v":"Obstacle C"},null,null,null,{"$f":"IF('00'!F27=\"\",\"\",'00'!F27)","v":""},null,null,null,null,null,null,null,{"$f":"IF(B27=\"\",\"\",IF(E27>F27,\"! ? !\",\"OK\"))","v":"OK"},null,{"$f":"IF(AND(B27=\" -\",E27<>0),\"! ? !\",\"OK\")","v":"OK"}]
[null,{"$f":"IF('00'!B28=\"\",\" -\",'00'!B28)","v":" -"},null,null,null,{"$f":"IF('00'!F28=\"\",\"\",'00'!F28)","v":""},null,null,null,null,null,null,null,{"$f":"IF(B28=\"\",\"\",IF(E28>F28,\"! ? !\",\"OK\"))","v":"OK"},null,{"$f":"IF(AND(B28=\" -\",E28<>0),\"! ? !\",\"OK\")","v":"OK"}]
[null,{"$f":"IF('00'!B29=\"\",\" -\",'00'!B29)","v":" -"}]
[null,{"$f":"IF('00'!B30=\"\",\" -\",'00'!B30)","v":"Conduite /Moving"},null,{"$f":"IF('00'!D30=\"\",\"\",'00'!D30)","v":45},null,{"$f":"IF('00'!F30=\"\",\"\",'00'!F30)","v":20},{"$f":"SUM(F30:F36)","v":45},null,null,null,null,null,null,{"$f":"IF(B30=\"\",\"\",IF(E30>F30,\"! ? !\",\"OK\"))","v":"OK"},null,{"$f":"IF(AND(B30=\" -\",E30<>0),\"! ? !\",\"OK\")","v":"OK"},null,"Contrôle-2 : Contrôle que les lignes sans épreuve ne contiennent pas de note"]
[null,{"$f":"IF('00'!B31=\"\",\" -\",'00'!B31)","v":"Pâturage / Grazing"},null,null,null,{"$f":"IF('00'!F31=\"\",\"\",'00'!F31)","v":20},null,null,null,null,null,null,null,"OK",null,"OK"]
[null,{"$f":"IF('00'!B32=\"\",\" -\",'00'!B32)","v":"Prise de brebis/ catching sheep and holding a sheep "},null,null,null,{"$f":"IF('00'!F32=\"\",\"\",'00'!F32)","v":5},null,null,null,null,null,null,null,"OK",null,"OK"]
[null,{"$f":"IF('00'!B33=\"\",\" -\",'00'!B33)","v":"Protection de cultures/ Crop protection "},null,null,null,{"$f":"IF('00'!F33=\"\",\"\",'00'!F33)","v":""},null,null,null,null,null,null,null,"OK",null,"OK"]
[null,{"$f":"IF('00'!B34=\"\",\" -\",'00'!B34)","v":"Traffic/ Vehicule "},null,null,null,{"$f":"IF('00'!F34=\"\",\"\",'00'!F34)","v":""},null,null,null,null,null,null,null,"OK",null,"OK"]
[null,{"$f":"IF('00'!B35=\"\",\" -\",'00'!B35)","v":" -"},null,null,null,{"$f":"IF('00'!F35=\"\",\"\",'00'!F35)","v":""},null,null,null,null,null,null,null,"OK",null,"OK"]
[null,{"$f":"IF('00'!B36=\"\",\" -\",'00'!B36)","v":" -"},null,null,null,{"$f":"IF('00'!F36=\"\",\"\",'00'!F36)","v":""},null,null,null,null,null,null,null,"OK",null,"OK"]
[null,{"$f":"IF('00'!B37=\"\",\" -\",'00'!B37)","v":" -"}]
[null,{"$f":"IF('00'!B38=\"\",\" -\",'00'!B38)","v":"Arrêt du troupeau / Stop 1"},null,{"$f":"IF('00'!D38=\"\",\"\",'00'!D38)","v":10},null,{"$f":"IF('00'!F38=\"\",\"\",'00'!F38)","v":10},{"$f":"SUM(F38:F41)","v":10},null,null,null,null,null,null,{"$f":"IF(B38=\"\",\"\",IF(E38>F38,\"! ? !\",\"OK\"))","v":"OK"},null,{"$f":"IF(AND(B38=\" -\",E38<>0),\"! ? !\",\"OK\")","v":"OK"}]
[null,{"$f":"IF('00'!B39=\"\",\" -\",'00'!B39)","v":"Arrêt du troupeau / Stop 2"},null,null,null,{"$f":"IF('00'!F39=\"\",\"\",'00'!F39)","v":""},null,null,null,null,null,null,null,{"$f":"IF(B39=\"\",\"\",IF(E39>F39,\"! ? !\",\"OK\"))","v":"OK"},null,{"$f":"IF(AND(B39=\" -\",E39<>0),\"! ? !\",\"OK\")","v":"OK"}]
[null,{"$f":"IF('00'!B40=\"\",\" -\",'00'!B40)","v":"Arrêt du troupeau / Stop 3"},null,null,null,{"$f":"IF('00'!F40=\"\",\"\",'00'!F40)","v":""},null,null,null,null,null,null,null,{"$f":"IF(B40=\"\",\"\",IF(E40>F40,\"! ? !\",\"OK\"))","v":"OK"},null,{"$f":"IF(AND(B40=\" -\",E40<>0),\"! ? !\",\"OK\")","v":"OK"}]
[null,{"$f":"IF('00'!B41=\"\",\" -\",'00'!B41)","v":" -"},null,null,null,{"$f":"IF('00'!F41=\"\",\"\",'00'!F41)","v":""},null,null,null,null,null,null,null,{"$f":"IF(B41=\"\",\"\",IF(E41>F41,\"! ? !\",\"OK\"))","v":"OK"},null,{"$f":"IF(AND(B41=\" -\",E41<>0),\"! ? !\",\"OK\")","v":"OK"}]
[null,{"$f":"IF('00'!B42=\"\",\" -\",'00'!B42)","v":" -"}]
[null,{"$f":"IF('00'!B43=\"\",\" -\",'00'!B43)","v":"Aptitude naturelle / Natural ability "},null,{"$f":"IF('00'!D43=\"\",\"\",'00'!D43)","v":10},null,{"$f":"IF('00'!F43=\"\",\"\",'00'!F43)","v":3},{"$f":"SUM(F43:F47)","v":10},null,null,null,null,null,null,{"$f":"IF(B43=\"\",\"\",IF(E43>F43,\"! ? !\",\"OK\"))","v":"OK"},null,{"$f":"IF(AND(B43=\" -\",E43<>0),\"! ? !\",\"OK\")","v":"OK"}]
[null,{"$f":"IF('00'!B44=\"\",\" -\",'00'!B44)","v":"Absence d’agressivité/ gentleness "},null,null,null,{"$f":"IF('00'!F44=\"\",\"\",'00'!F44)","v":2},null,null,null,null,null,null,null,"OK",null,"OK"]
[null,{"$f":"IF('00'!B45=\"\",\" -\",'00'!B45)","v":"Intelligence d’exécution/ Intelligence of execution  "},null,null,null,{"$f":"IF('00'!F45=\"\",\"\",'00'!F45)","v":2},null,null,null,null,null,null,null,"OK",null,"OK"]
[null,{"$f":"IF('00'!B46=\"\",\" -\",'00'!B46)","v":"Obéissance / Obedience "},null,null,null,{"$f":"IF('00'!F46=\"\",\"\",'00'!F46)","v":3},null,null,null,null,null,null,null,"OK",null,"OK"]
[null,{"$f":"IF('00'!B47=\"\",\" -\",'00'!B47)","v":" -"},null,null,null,{"$f":"IF('00'!F47=\"\",\"\",'00'!F47)","v":""},null,null,null,null,null,null,null,"OK",null,"OK"]
[null,{"$f":"IF('00'!B48=\"\",\" -\",'00'!B48)","v":" -"},null,{"$f":"IF('00'!D48=\"\",\"\",'00'!D48)","v":""},null,{"$f":"IF('00'!F48=\"\",\"\",'00'!F48)","v":""},{"$f":"SUM(F48:F50)","v":0},null,null,null,null,null,null,"OK",null,"OK"]
[null,{"$f":"IF('00'!B49=\"\",\" -\",'00'!B49)","v":" -"},null,null,null,{"$f":"IF('00'!F49=\"\",\"\",'00'!F49)","v":""},null,null,null,null,null,null,null,"OK",null,"OK"," "]
[null,{"$f":"IF('00'!B50=\"\",\" -\",'00'!B50)","v":" -"},null,null,null,{"$f":"IF('00'!F50=\"\",\"\",'00'!F50)","v":""},null,null,null,null,null,null,null,"OK",null,"OK"]
[null,"Pointage du Travail  ==>  ",null,null,{"$f":"SUM(E17:E50)","v":0},{"$f":"SUM(F17:F50)","v":100},null,null,"Temps = "]
[null,"Pénalités Générales :\n(chiffre négatif)    .",null,null,null,null,null,"Informations sur les pénalités générales :\n   \n   \n   ",null,null,"Classement :",null,null,{"$f":"IF(E52=\"\",\"\",IF(E52>0,\"ATTENTION : 'Pénalité Générales' doit être un nombre négatif ! \",\"OK\"))","v":""}]
[null,"TOTAL GENERAL =",null,null,{"$f":"IF(COUNT(E17:E50)=0,\"-\",E51+E52)","v":"-"},null,null,"Qualificatif :",{"$f":"IF(E53=\"-\",\"-\",IF(E53>89.9999,\"EXCELLENT\",IF(E53>79.9999,\"TRES BON\",IF(E53>69.999,\"BON\",IF(E53>59.999,\"Satisfaisant\",IF(E53>0.1,\"insuffisant \",\"éliminé \"))))))","v":"-"},null,{"$f":"Fiche_organisateur_N°2!P28","v":"X"},{"$f":"'Rapport de Concours'!D40","v":0}]
[null,"CACITR / RCACITR / CACTR / RCACTR :",null,null," -",null,null," <== sur décision du juge "]
[null,"Observations :  ",null,null,null,null,null,null,null,null,null,null,{"$f":"M51+M52","v":0}]
[]
[null,null,null,null,null,null,null,null,"Le Juge :",{"$f":"Fiche_organisateur_N°1!E28","v":0}]

{"sheet":"13","index":20,"n_rows":57,"n_cols":18,"rows_kept":57,"cut":false,"hidden":false,"merged":[[9,2,9,9],[0,10,0,11],[2,1,2,11],[3,1,3,11],[6,10,6,11],[8,1,8,11],[14,4,14,5],[14,7,14,11],[15,1,15,11],[16,1,16,2],[16,3,21,3],[16,6,21,6],[16,7,16,11],[17,1,17,2],[17,7,17,11],[18,1,18,2],[18,7,18,11],[19,1,19,2],[19,7,19,11],[20,1,20,2],[20,7,20,11],[28,1,28,11],[21,1,21,2],[21,7,21,11],[22,1,22,11],[23,1,23,2],[23,3,27,3],[23,6,27,6],[23,7,23,11],[24,1,24,2],[24,7,24,11],[25,1,25,2],[25,7,25,11],[26,1,26,2],[26,7,26,11],[27,1,27,2],[27,7,27,11],[29,1,29,2],[29,3,35,3],[29,6,35,6],[29,7,29,11],[30,1,30,2],[30,7,30,11],[31,1,31,2],[31,7,31,11],[32,1,32,2],[32,7,32,11],[33,1,33,2],[33,7,33,11],[34,1,34,2],[34,7,34,11],[35,1,35,2],[35,7,35,11],[36,1,36,11],[37,1,37,2],[37,3,40,3],[37,6,40,6],[37,7,37,11],[38,1,38,2],[38,7,38,11],[39,1,39,2],[39,7,39,11],[40,1,40,2],[40,7,40,11],[41,1,41,11],[42,1,42,2],[42,3,46,3],[42,6,46,6],[42,7,42,11],[43,1,43,2],[43,7,43,11],[44,1,44,2],[44,7,44,11],[45,1,45,2],[45,7,45,11],[46,1,46,2],[46,7,46,11],[47,1,47,2],[47,3,49,3],[47,6,49,6],[47,7,47,11],[48,1,48,2],[48,7,48,11],[49,1,49,2],[49,7,49,11],[50,1,50,3],[50,9,50,11],[51,1,51,3],[51,7,51,9],[51,10,51,11],[54,1,54,11],[56,9,56,11],[52,1,52,3],[52,4,52,5],[52,8,52,9],[53,1,53,3],[53,4,53,5],[53,7,53,9]]}
[null,null,null,null,null,null,null,null,null,null,"NIVEAU 2"]
[]
[null,"COMMISSION D'UTILISATION TROUPEAUX"]
[null,"Epreuve de travail sur Ovins\nTRADITIONAL STYLE CLASSE 2"]
[null,"ORGANISATEUR :",{"$f":"Fiche_organisateur_N°1!E15","v":0}]
[null,"Lieu :",{"$f":"Fiche_organisateur_N°1!E16","v":0},null,null,null,null,"Date :",{"$f":"IF(Fiche_organisateur_N°1!E13=\"\",\"\",Fiche_organisateur_N°1!E13)","v":""}]
[null,null,null,null,null,null,null,null,null,null,{"$f":"Fiche_organisateur_N°1!$E$26","v":"IHT 1"}]
[]
[null,"COMMISSION D'UTILISATION TROUPEAUX"]
[null,null,"Epreuve de travail sur Ovins - TRADITIONAL STYLE "]
[null,"ORGANISATEUR :",{"$f":"Fiche_organisateur_N°1!E21","v":0}]
[null,"Lieu :",{"$f":"Fiche_organisateur_N°1!E22","v":0},null,null,null,null,"Date :",{"$f":"Fiche_organisateur_N°1!$E$13","v":0},null,null,null,null,"Contrôle de saisie (sur les onglets 01 à 20 )"]
[null,"Contact :",{"$f":"Fiche_organisateur_N°1!E24","v":0}]
[null,null,null,null,null,null,null,null,null,null,null,null,null,"Ces colonnes n'apparaissent pas lors de l'impression…"]
[null,"Epreuves                ",null,null,"Pointages /100",null,null,{"$f":"IF(OR('00'!N51<>30,LEFT('00'!H51,9)=\"ATTENTION\")=1,\"NON VALIDE => corriger la feuille 00 ! ! !\",\"Observations\")","v":"Observations"},null,null,null,null,null,"contrôle-1",null,"contrôle-2"]
[null,{"$f":"IF('00'!B16=\"\",\" -\",'00'!B16)","v":" -"}]
[null,{"$f":"IF('00'!B17=\"\",\" -\",'00'!B17)","v":"Sortie de parc ou bergerie / Exit from the pen "},null,{"$f":"IF('00'!D17=\"\",\"\",'00'!D17)","v":20},null,{"$f":"IF('00'!F17=\"\",\"\",'00'!F17)","v":15},{"$f":"SUM(F17:F22)","v":20},null,null,null,null,null,null,{"$f":"IF(B17=\"\",\"\",IF(E17>F17,\"! ? !\",\"OK\"))","v":"OK"},null,{"$f":"IF(AND(B17=\" -\",E17<>0),\"! ? !\",\"OK\")","v":"OK"}]
[null,{"$f":"IF('00'!B18=\"\",\" -\",'00'!B18)","v":" -"},null,null,null,{"$f":"IF('00'!F18=\"\",\"\",'00'!F18)","v":""},null,null,null,null,null,null,null,"OK",null,"OK",null,"Contrôle-1 : Contrôle que les valeurs entrées ne sont pas supérieures"]
[null,{"$f":"IF('00'!B19=\"\",\" -\",'00'!B19)","v":" -"},null,null,null,{"$f":"IF('00'!F19=\"\",\"\",'00'!F19)","v":""},null,null,null,null,null,null,null,"OK",null,"OK",null,"                    aux pointages maxi attribués à chaque épreuve…"]
[null,{"$f":"IF('00'!B20=\"\",\" -\",'00'!B20)","v":" -"},null,null,null,{"$f":"IF('00'!F20=\"\",\"\",'00'!F20)","v":""},null,null,null,null,null,null,null,"OK",null,"OK"]
[null,{"$f":"IF('00'!B21=\"\",\" -\",'00'!B21)","v":" -"},null,null,null,{"$f":"IF('00'!F21=\"\",\"\",'00'!F21)","v":""},null,null,null,null,null,null,null,"OK",null,"OK"]
[null,{"$f":"IF('00'!B22=\"\",\" -\",'00'!B22)","v":"Rentrée du troupeau  / Re-pen"},null,null,null,{"$f":"IF('00'!F22=\"\",\"\",'00'!F22)","v":5},null,null,null,null,null,null,null,"OK",null,"OK"]
[null,{"$f":"IF('00'!B23=\"\",\" -\",'00'!B23)","v":" -"}]
[null,{"$f":"IF('00'!B24=\"\",\" -\",'00'!B24)","v":"Pont/ Bridge"},null,{"$f":"IF('00'!D24=\"\",\"\",'00'!D24)","v":15},null,{"$f":"IF('00'!F24=\"\",\"\",'00'!F24)","v":5},{"$f":"SUM(F24:F28)","v":15},null,null,null,null,null,null,{"$f":"IF(B24=\"\",\"\",IF(E24>F24,\"! ? !\",\"OK\"))","v":"OK"},null,{"$f":"IF(AND(B24=\" -\",E24<>0),\"! ? !\",\"OK\")","v":"OK"}]
[null,{"$f":"IF('00'!B25=\"\",\" -\",'00'!B25)","v":"obstacle A"},null,null,null,{"$f":"IF('00'!F25=\"\",\"\",'00'!F25)","v":10},null,null,null,null,null,null,null,{"$f":"IF(B25=\"\",\"\",IF(E25>F25,\"! ? !\",\"OK\"))","v":"OK"},null,{"$f":"IF(AND(B25=\" -\",E25<>0),\"! ? !\",\"OK\")","v":"OK"}]
[null,{"$f":"IF('00'!B26=\"\",\" -\",'00'!B26)","v":"Qbstacle B"},null,null,null,{"$f":"IF('00'!F26=\"\",\"\",'00'!F26)","v":""},null,null,null,null,null,null,null,{"$f":"IF(B26=\"\",\"\",IF(E26>F26,\"! ? !\",\"OK\"))","v":"OK"},null,{"$f":"IF(AND(B26=\" -\",E26<>0),\"! ? !\",\"OK\")","v":"OK"}]
[null,{"$f":"IF('00'!B27=\"\",\" -\",'00'!B27)","v":"Obstacle C"},null,null,null,{"$f":"IF('00'!F27=\"\",\"\",'00'!F27)","v":""},null,null,null,null,null,null,null,{"$f":"IF(B27=\"\",\"\",IF(E27>F27,\"! ? !\",\"OK\"))","v":"OK"},null,{"$f":"IF(AND(B27=\" -\",E27<>0),\"! ? !\",\"OK\")","v":"OK"}]
[null,{"$f":"IF('00'!B28=\"\",\" -\",'00'!B28)","v":" -"},null,null,null,{"$f":"IF('00'!F28=\"\",\"\",'00'!F28)","v":""},null,null,null,null,null,null,null,{"$f":"IF(B28=\"\",\"\",IF(E28>F28,\"! ? !\",\"OK\"))","v":"OK"},null,{"$f":"IF(AND(B28=\" -\",E28<>0),\"! ? !\",\"OK\")","v":"OK"}]
[null,{"$f":"IF('00'!B29=\"\",\" -\",'00'!B29)","v":" -"}]
[null,{"$f":"IF('00'!B30=\"\",\" -\",'00'!B30)","v":"Conduite /Moving"},null,{"$f":"IF('00'!D30=\"\",\"\",'00'!D30)","v":45},null,{"$f":"IF('00'!F30=\"\",\"\",'00'!F30)","v":20},{"$f":"SUM(F30:F36)","v":45},null,null,null,null,null,null,{"$f":"IF(B30=\"\",\"\",IF(E30>F30,\"! ? !\",\"OK\"))","v":"OK"},null,{"$f":"IF(AND(B30=\" -\",E30<>0),\"! ? !\",\"OK\")","v":"OK"},null,"Contrôle-2 : Contrôle que les lignes sans épreuve ne contiennent pas de note"]
[null,{"$f":"IF('00'!B31=\"\",\" -\",'00'!B31)","v":"Pâturage / Grazing"},null,null,null,{"$f":"IF('00'!F31=\"\",\"\",'00'!F31)","v":20},null,null,null,null,null,null,null,"OK",null,"OK"]
[null,{"$f":"IF('00'!B32=\"\",\" -\",'00'!B32)","v":"Prise de brebis/ catching sheep and holding a sheep "},null,null,null,{"$f":"IF('00'!F32=\"\",\"\",'00'!F32)","v":5},null,null,null,null,null,null,null,"OK",null,"OK"]
[null,{"$f":"IF('00'!B33=\"\",\" -\",'00'!B33)","v":"Protection de cultures/ Crop protection "},null,null,null,{"$f":"IF('00'!F33=\"\",\"\",'00'!F33)","v":""},null,null,null,null,null,null,null,"OK",null,"OK"]
[null,{"$f":"IF('00'!B34=\"\",\" -\",'00'!B34)","v":"Traffic/ Vehicule "},null,null,null,{"$f":"IF('00'!F34=\"\",\"\",'00'!F34)","v":""},null,null,null,null,null,null,null,"OK",null,"OK"]
[null,{"$f":"IF('00'!B35=\"\",\" -\",'00'!B35)","v":" -"},null,null,null,{"$f":"IF('00'!F35=\"\",\"\",'00'!F35)","v":""},null,null,null,null,null,null,null,"OK",null,"OK"]
[null,{"$f":"IF('00'!B36=\"\",\" -\",'00'!B36)","v":" -"},null,null,null,{"$f":"IF('00'!F36=\"\",\"\",'00'!F36)","v":""},null,null,null,null,null,null,null,"OK",null,"OK"]
[null,{"$f":"IF('00'!B37=\"\",\" -\",'00'!B37)","v":" -"}]
[null,{"$f":"IF('00'!B38=\"\",\" -\",'00'!B38)","v":"Arrêt du troupeau / Stop 1"},null,{"$f":"IF('00'!D38=\"\",\"\",'00'!D38)","v":10},null,{"$f":"IF('00'!F38=\"\",\"\",'00'!F38)","v":10},{"$f":"SUM(F38:F41)","v":10},null,null,null,null,null,null,{"$f":"IF(B38=\"\",\"\",IF(E38>F38,\"! ? !\",\"OK\"))","v":"OK"},null,{"$f":"IF(AND(B38=\" -\",E38<>0),\"! ? !\",\"OK\")","v":"OK"}]
[null,{"$f":"IF('00'!B39=\"\",\" -\",'00'!B39)","v":"Arrêt du troupeau / Stop 2"},null,null,null,{"$f":"IF('00'!F39=\"\",\"\",'00'!F39)","v":""},null,null,null,null,null,null,null,{"$f":"IF(B39=\"\",\"\",IF(E39>F39,\"! ? !\",\"OK\"))","v":"OK"},null,{"$f":"IF(AND(B39=\" -\",E39<>0),\"! ? !\",\"OK\")","v":"OK"}]
[null,{"$f":"IF('00'!B40=\"\",\" -\",'00'!B40)","v":"Arrêt du troupeau / Stop 3"},null,null,null,{"$f":"IF('00'!F40=\"\",\"\",'00'!F40)","v":""},null,null,null,null,null,null,null,{"$f":"IF(B40=\"\",\"\",IF(E40>F40,\"! ? !\",\"OK\"))","v":"OK"},null,{"$f":"IF(AND(B40=\" -\",E40<>0),\"! ? !\",\"OK\")","v":"OK"}]
[null,{"$f":"IF('00'!B41=\"\",\" -\",'00'!B41)","v":" -"},null,null,null,{"$f":"IF('00'!F41=\"\",\"\",'00'!F41)","v":""},null,null,null,null,null,null,null,{"$f":"IF(B41=\"\",\"\",IF(E41>F41,\"! ? !\",\"OK\"))","v":"OK"},null,{"$f":"IF(AND(B41=\" -\",E41<>0),\"! ? !\",\"OK\")","v":"OK"}]
[null,{"$f":"IF('00'!B42=\"\",\" -\",'00'!B42)","v":" -"}]
[null,{"$f":"IF('00'!B43=\"\",\" -\",'00'!B43)","v":"Aptitude naturelle / Natural ability "},null,{"$f":"IF('00'!D43=\"\",\"\",'00'!D43)","v":10},null,{"$f":"IF('00'!F43=\"\",\"\",'00'!F43)","v":3},{"$f":"SUM(F43:F47)","v":10},null,null,null,null,null,null,{"$f":"IF(B43=\"\",\"\",IF(E43>F43,\"! ? !\",\"OK\"))","v":"OK"},null,{"$f":"IF(AND(B43=\" -\",E43<>0),\"! ? !\",\"OK\")","v":"OK"}]
[null,{"$f":"IF('00'!B44=\"\",\" -\",'00'!B44)","v":"Absence d’agressivité/ gentleness "},null,null,null,{"$f":"IF('00'!F44=\"\",\"\",'00'!F44)","v":2},null,null,null,null,null,null,null,"OK",null,"OK"]
[null,{"$f":"IF('00'!B45=\"\",\" -\",'00'!B45)","v":"Intelligence d’exécution/ Intelligence of execution  "},null,null,null,{"$f":"IF('00'!F45=\"\",\"\",'00'!F45)","v":2},null,null,null,null,null,null,null,"OK",null,"OK"]
[null,{"$f":"IF('00'!B46=\"\",\" -\",'00'!B46)","v":"Obéissance / Obedience "},null,null,null,{"$f":"IF('00'!F46=\"\",\"\",'00'!F46)","v":3},null,null,null,null,null,null,null,"OK",null,"OK"]
[null,{"$f":"IF('00'!B47=\"\",\" -\",'00'!B47)","v":" -"},null,null,null,{"$f":"IF('00'!F47=\"\",\"\",'00'!F47)","v":""},null,null,null,null,null,null,null,"OK",null,"OK"]
[null,{"$f":"IF('00'!B48=\"\",\" -\",'00'!B48)","v":" -"},null,{"$f":"IF('00'!D48=\"\",\"\",'00'!D48)","v":""},null,{"$f":"IF('00'!F48=\"\",\"\",'00'!F48)","v":""},{"$f":"SUM(F48:F50)","v":0},null,null,null,null,null,null,"OK",null,"OK"]
[null,{"$f":"IF('00'!B49=\"\",\" -\",'00'!B49)","v":" -"},null,null,null,{"$f":"IF('00'!F49=\"\",\"\",'00'!F49)","v":""},null,null,null,null,null,null,null,"OK",null,"OK"," "]
[null,{"$f":"IF('00'!B50=\"\",\" -\",'00'!B50)","v":" -"},null,null,null,{"$f":"IF('00'!F50=\"\",\"\",'00'!F50)","v":""},null,null,null,null,null,null,null,"OK",null,"OK"]
[null,"Pointage du Travail  ==>  ",null,null,{"$f":"SUM(E17:E50)","v":0},{"$f":"SUM(F17:F50)","v":100},null,null,"Temps = "]
[null,"Pénalités Générales :\n(chiffre négatif)    .",null,null,null,null,null,"Informations sur les pénalités générales :\n   \n   \n   ",null,null,"Classement :",null,null,{"$f":"IF(E52=\"\",\"\",IF(E52>0,\"ATTENTION : 'Pénalité Générales' doit être un nombre négatif ! \",\"OK\"))","v":""}]
[null,"TOTAL GENERAL =",null,null,{"$f":"IF(COUNT(E17:E50)=0,\"-\",E51+E52)","v":"-"},null,null,"Qualificatif :",{"$f":"IF(E53=\"-\",\"-\",IF(E53>89.9999,\"EXCELLENT\",IF(E53>79.9999,\"TRES BON\",IF(E53>69.999,\"BON\",IF(E53>59.999,\"Satisfaisant\",IF(E53>0.1,\"insuffisant \",\"éliminé \"))))))","v":"-"},null,{"$f":"Fiche_organisateur_N°2!P29","v":"X"},{"$f":"'Rapport de Concours'!D40","v":0}]
[null,"CACITR / RCACITR / CACTR / RCACTR :",null,null," -",null,null," <== sur décision du juge "]
[null,"Observations :  ",null,null,null,null,null,null,null,null,null,null,{"$f":"M51+M52","v":0}]
[]
[null,null,null,null,null,null,null,null,"Le Juge :",{"$f":"Fiche_organisateur_N°1!E28","v":0}]

{"sheet":"14","index":21,"n_rows":57,"n_cols":18,"rows_kept":57,"cut":false,"hidden":false,"merged":[[10,8,10,9],[0,10,0,11],[2,1,2,11],[8,8,8,9],[9,8,9,9],[3,2,3,9],[11,8,11,9],[14,4,14,5],[14,7,14,11],[15,1,15,11],[16,1,16,2],[16,3,21,3],[16,6,21,6],[16,7,16,11],[17,1,17,2],[17,7,17,11],[18,1,18,2],[18,7,18,11],[19,1,19,2],[19,7,19,11],[20,1,20,2],[20,7,20,11],[28,1,28,11],[21,1,21,2],[21,7,21,11],[22,1,22,11],[23,1,23,2],[23,3,27,3],[23,6,27,6],[23,7,23,11],[24,1,24,2],[24,7,24,11],[25,1,25,2],[25,7,25,11],[26,1,26,2],[26,7,26,11],[27,1,27,2],[27,7,27,11],[29,1,29,2],[29,3,35,3],[29,6,35,6],[29,7,29,11],[30,1,30,2],[30,7,30,11],[31,1,31,2],[31,7,31,11],[32,1,32,2],[32,7,32,11],[33,1,33,2],[33,7,33,11],[34,1,34,2],[34,7,34,11],[35,1,35,2],[35,7,35,11],[36,1,36,11],[37,1,37,2],[37,3,40,3],[37,6,40,6],[37,7,37,11],[38,1,38,2],[38,7,38,11],[39,1,39,2],[39,7,39,11],[40,1,40,2],[40,7,40,11],[41,1,41,11],[42,1,42,2],[42,3,46,3],[42,6,46,6],[42,7,42,11],[43,1,43,2],[43,7,43,11],[44,1,44,2],[44,7,44,11],[45,1,45,2],[45,7,45,11],[46,1,46,2],[46,7,46,11],[47,1,47,2],[47,3,49,3],[47,6,49,6],[47,7,47,11],[48,1,48,2],[48,7,48,11],[49,1,49,2],[49,7,49,11],[50,1,50,3],[50,9,50,11],[51,1,51,3],[51,7,51,9],[51,10,51,11],[54,1,54,11],[56,9,56,11],[52,1,52,3],[52,4,52,5],[52,8,52,9],[53,1,53,3],[53,4,53,5],[53,7,53,9]]}
[null,null,null,null,null,null,null,null,null,null,{"$f":"Fiche_organisateur_N°1!$E$26","v":"IHT 1"}]
[]
[null,"COMMISSION D'UTILISATION TROUPEAUX"]
[null,null,"Epreuve de travail sur Ovins - TRADITIONAL STYLE "]
[null,"ORGANISATEUR :",{"$f":"Fiche_organisateur_N°1!E15","v":0}]
[null,"Lieu :",{"$f":"Fiche_organisateur_N°1!E16","v":0},null,null,null,null,"Date :",{"$f":"Fiche_organisateur_N°1!$E$13","v":0}]
[null,"Contact :",{"$f":"Fiche_organisateur_N°1!E18","v":0}]
[]
[null,"PROPRIETAIRE :",{"$f":"Fiche_organisateur_N°2!C30","v":0},null,null,null,null,"Race et sexe",{"$f":"Fiche_organisateur_N°2!G30","v":0}]
[null,"CONDUCTEUR :",{"$f":"Fiche_organisateur_N°2!D30","v":0},null,null,null,null,"N° FAPAC :",{"$f":"Fiche_organisateur_N°2!K30","v":0}]
[null,"NOM DU CHIEN :",{"$f":"Fiche_organisateur_N°2!E30","v":0},null,null,null,null,"AFFIXE :",{"$f":"Fiche_organisateur_N°2!F30","v":0}]
[null,null,null,null,null,null,null,"N° d'Identification",{"$f":"Fiche_organisateur_N°2!L30","v":0},null,null,null,null,"Contrôle de saisie (sur les onglets 01 à 20 )"]
[]
[null,null,null,null,null,null,null,null,null,null,null,null,null,"Ces colonnes n'apparaissent pas lors de l'impression…"]
[null,"Epreuves                ",null,null,"Pointages /100",null,null,{"$f":"IF(OR('00'!N51<>30,LEFT('00'!H51,9)=\"ATTENTION\")=1,\"NON VALIDE => corriger la feuille 00 ! ! !\",\"Observations\")","v":"Observations"},null,null,null,null,null,"contrôle-1",null,"contrôle-2"]
[null,{"$f":"IF('00'!B16=\"\",\" -\",'00'!B16)","v":" -"}]
[null,{"$f":"IF('00'!B17=\"\",\" -\",'00'!B17)","v":"Sortie de parc ou bergerie / Exit from the pen "},null,{"$f":"IF('00'!D17=\"\",\"\",'00'!D17)","v":20},null,{"$f":"IF('00'!F17=\"\",\"\",'00'!F17)","v":15},{"$f":"SUM(F17:F22)","v":20},null,null,null,null,null,null,{"$f":"IF(B17=\"\",\"\",IF(E17>F17,\"! ? !\",\"OK\"))","v":"OK"},null,{"$f":"IF(AND(B17=\" -\",E17<>0),\"! ? !\",\"OK\")","v":"OK"}]
[null,{"$f":"IF('00'!B18=\"\",\" -\",'00'!B18)","v":" -"},null,null,null,{"$f":"IF('00'!F18=\"\",\"\",'00'!F18)","v":""},null,null,null,null,null,null,null,"OK",null,"OK",null,"Contrôle-1 : Contrôle que les valeurs entrées ne sont pas supérieures"]
[null,{"$f":"IF('00'!B19=\"\",\" -\",'00'!B19)","v":" -"},null,null,null,{"$f":"IF('00'!F19=\"\",\"\",'00'!F19)","v":""},null,null,null,null,null,null,null,"OK",null,"OK",null,"                    aux pointages maxi attribués à chaque épreuve…"]
[null,{"$f":"IF('00'!B20=\"\",\" -\",'00'!B20)","v":" -"},null,null,null,{"$f":"IF('00'!F20=\"\",\"\",'00'!F20)","v":""},null,null,null,null,null,null,null,"OK",null,"OK"]
[null,{"$f":"IF('00'!B21=\"\",\" -\",'00'!B21)","v":" -"},null,null,null,{"$f":"IF('00'!F21=\"\",\"\",'00'!F21)","v":""},null,null,null,null,null,null,null,"OK",null,"OK"]
[null,{"$f":"IF('00'!B22=\"\",\" -\",'00'!B22)","v":"Rentrée du troupeau  / Re-pen"},null,null,null,{"$f":"IF('00'!F22=\"\",\"\",'00'!F22)","v":5},null,null,null,null,null,null,null,"OK",null,"OK"]
[null,{"$f":"IF('00'!B23=\"\",\" -\",'00'!B23)","v":" -"}]
[null,{"$f":"IF('00'!B24=\"\",\" -\",'00'!B24)","v":"Pont/ Bridge"},null,{"$f":"IF('00'!D24=\"\",\"\",'00'!D24)","v":15},null,{"$f":"IF('00'!F24=\"\",\"\",'00'!F24)","v":5},{"$f":"SUM(F24:F28)","v":15},null,null,null,null,null,null,{"$f":"IF(B24=\"\",\"\",IF(E24>F24,\"! ? !\",\"OK\"))","v":"OK"},null,{"$f":"IF(AND(B24=\" -\",E24<>0),\"! ? !\",\"OK\")","v":"OK"}]
[null,{"$f":"IF('00'!B25=\"\",\" -\",'00'!B25)","v":"obstacle A"},null,null,null,{"$f":"IF('00'!F25=\"\",\"\",'00'!F25)","v":10},null,null,null,null,null,null,null,{"$f":"IF(B25=\"\",\"\",IF(E25>F25,\"! ? !\",\"OK\"))","v":"OK"},null,{"$f":"IF(AND(B25=\" -\",E25<>0),\"! ? !\",\"OK\")","v":"OK"}]
[null,{"$f":"IF('00'!B26=\"\",\" -\",'00'!B26)","v":"Qbstacle B"},null,null,null,{"$f":"IF('00'!F26=\"\",\"\",'00'!F26)","v":""},null,null,null,null,null,null,null,{"$f":"IF(B26=\"\",\"\",IF(E26>F26,\"! ? !\",\"OK\"))","v":"OK"},null,{"$f":"IF(AND(B26=\" -\",E26<>0),\"! ? !\",\"OK\")","v":"OK"}]
[null,{"$f":"IF('00'!B27=\"\",\" -\",'00'!B27)","v":"Obstacle C"},null,null,null,{"$f":"IF('00'!F27=\"\",\"\",'00'!F27)","v":""},null,null,null,null,null,null,null,{"$f":"IF(B27=\"\",\"\",IF(E27>F27,\"! ? !\",\"OK\"))","v":"OK"},null,{"$f":"IF(AND(B27=\" -\",E27<>0),\"! ? !\",\"OK\")","v":"OK"}]
[null,{"$f":"IF('00'!B28=\"\",\" -\",'00'!B28)","v":" -"},null,null,null,{"$f":"IF('00'!F28=\"\",\"\",'00'!F28)","v":""},null,null,null,null,null,null,null,{"$f":"IF(B28=\"\",\"\",IF(E28>F28,\"! ? !\",\"OK\"))","v":"OK"},null,{"$f":"IF(AND(B28=\" -\",E28<>0),\"! ? !\",\"OK\")","v":"OK"}]
[null,{"$f":"IF('00'!B29=\"\",\" -\",'00'!B29)","v":" -"}]
[null,{"$f":"IF('00'!B30=\"\",\" -\",'00'!B30)","v":"Conduite /Moving"},null,{"$f":"IF('00'!D30=\"\",\"\",'00'!D30)","v":45},null,{"$f":"IF('00'!F30=\"\",\"\",'00'!F30)","v":20},{"$f":"SUM(F30:F36)","v":45},null,null,null,null,null,null,{"$f":"IF(B30=\"\",\"\",IF(E30>F30,\"! ? !\",\"OK\"))","v":"OK"},null,{"$f":"IF(AND(B30=\" -\",E30<>0),\"! ? !\",\"OK\")","v":"OK"},null,"Contrôle-2 : Contrôle que les lignes sans épreuve ne contiennent pas de note"]
[null,{"$f":"IF('00'!B31=\"\",\" -\",'00'!B31)","v":"Pâturage / Grazing"},null,null,null,{"$f":"IF('00'!F31=\"\",\"\",'00'!F31)","v":20},null,null,null,null,null,null,null,"OK",null,"OK"]
[null,{"$f":"IF('00'!B32=\"\",\" -\",'00'!B32)","v":"Prise de brebis/ catching sheep and holding a sheep "},null,null,null,{"$f":"IF('00'!F32=\"\",\"\",'00'!F32)","v":5},null,null,null,null,null,null,null,"OK",null,"OK"]
[null,{"$f":"IF('00'!B33=\"\",\" -\",'00'!B33)","v":"Protection de cultures/ Crop protection "},null,null,null,{"$f":"IF('00'!F33=\"\",\"\",'00'!F33)","v":""},null,null,null,null,null,null,null,"OK",null,"OK"]
[null,{"$f":"IF('00'!B34=\"\",\" -\",'00'!B34)","v":"Traffic/ Vehicule "},null,null,null,{"$f":"IF('00'!F34=\"\",\"\",'00'!F34)","v":""},null,null,null,null,null,null,null,"OK",null,"OK"]
[null,{"$f":"IF('00'!B35=\"\",\" -\",'00'!B35)","v":" -"},null,null,null,{"$f":"IF('00'!F35=\"\",\"\",'00'!F35)","v":""},null,null,null,null,null,null,null,"OK",null,"OK"]
[null,{"$f":"IF('00'!B36=\"\",\" -\",'00'!B36)","v":" -"},null,null,null,{"$f":"IF('00'!F36=\"\",\"\",'00'!F36)","v":""},null,null,null,null,null,null,null,"OK",null,"OK"]
[null,{"$f":"IF('00'!B37=\"\",\" -\",'00'!B37)","v":" -"}]
[null,{"$f":"IF('00'!B38=\"\",\" -\",'00'!B38)","v":"Arrêt du troupeau / Stop 1"},null,{"$f":"IF('00'!D38=\"\",\"\",'00'!D38)","v":10},null,{"$f":"IF('00'!F38=\"\",\"\",'00'!F38)","v":10},{"$f":"SUM(F38:F41)","v":10},null,null,null,null,null,null,{"$f":"IF(B38=\"\",\"\",IF(E38>F38,\"! ? !\",\"OK\"))","v":"OK"},null,{"$f":"IF(AND(B38=\" -\",E38<>0),\"! ? !\",\"OK\")","v":"OK"}]
[null,{"$f":"IF('00'!B39=\"\",\" -\",'00'!B39)","v":"Arrêt du troupeau / Stop 2"},null,null,null,{"$f":"IF('00'!F39=\"\",\"\",'00'!F39)","v":""},null,null,null,null,null,null,null,{"$f":"IF(B39=\"\",\"\",IF(E39>F39,\"! ? !\",\"OK\"))","v":"OK"},null,{"$f":"IF(AND(B39=\" -\",E39<>0),\"! ? !\",\"OK\")","v":"OK"}]
[null,{"$f":"IF('00'!B40=\"\",\" -\",'00'!B40)","v":"Arrêt du troupeau / Stop 3"},null,null,null,{"$f":"IF('00'!F40=\"\",\"\",'00'!F40)","v":""},null,null,null,null,null,null,null,{"$f":"IF(B40=\"\",\"\",IF(E40>F40,\"! ? !\",\"OK\"))","v":"OK"},null,{"$f":"IF(AND(B40=\" -\",E40<>0),\"! ? !\",\"OK\")","v":"OK"}]
[null,{"$f":"IF('00'!B41=\"\",\" -\",'00'!B41)","v":" -"},null,null,null,{"$f":"IF('00'!F41=\"\",\"\",'00'!F41)","v":""},null,null,null,null,null,null,null,{"$f":"IF(B41=\"\",\"\",IF(E41>F41,\"! ? !\",\"OK\"))","v":"OK"},null,{"$f":"IF(AND(B41=\" -\",E41<>0),\"! ? !\",\"OK\")","v":"OK"}]
[null,{"$f":"IF('00'!B42=\"\",\" -\",'00'!B42)","v":" -"}]
[null,{"$f":"IF('00'!B43=\"\",\" -\",'00'!B43)","v":"Aptitude naturelle / Natural ability "},null,{"$f":"IF('00'!D43=\"\",\"\",'00'!D43)","v":10},null,{"$f":"IF('00'!F43=\"\",\"\",'00'!F43)","v":3},{"$f":"SUM(F43:F47)","v":10},null,null,null,null,null,null,{"$f":"IF(B43=\"\",\"\",IF(E43>F43,\"! ? !\",\"OK\"))","v":"OK"},null,{"$f":"IF(AND(B43=\" -\",E43<>0),\"! ? !\",\"OK\")","v":"OK"}]
[null,{"$f":"IF('00'!B44=\"\",\" -\",'00'!B44)","v":"Absence d’agressivité/ gentleness "},null,null,null,{"$f":"IF('00'!F44=\"\",\"\",'00'!F44)","v":2},null,null,null,null,null,null,null,"OK",null,"OK"]
[null,{"$f":"IF('00'!B45=\"\",\" -\",'00'!B45)","v":"Intelligence d’exécution/ Intelligence of execution  "},null,null,null,{"$f":"IF('00'!F45=\"\",\"\",'00'!F45)","v":2},null,null,null,null,null,null,null,"OK",null,"OK"]
[null,{"$f":"IF('00'!B46=\"\",\" -\",'00'!B46)","v":"Obéissance / Obedience "},null,null,null,{"$f":"IF('00'!F46=\"\",\"\",'00'!F46)","v":3},null,null,null,null,null,null,null,"OK",null,"OK"]
[null,{"$f":"IF('00'!B47=\"\",\" -\",'00'!B47)","v":" -"},null,null,null,{"$f":"IF('00'!F47=\"\",\"\",'00'!F47)","v":""},null,null,null,null,null,null,null,"OK",null,"OK"]
[null,{"$f":"IF('00'!B48=\"\",\" -\",'00'!B48)","v":" -"},null,{"$f":"IF('00'!D48=\"\",\"\",'00'!D48)","v":""},null,{"$f":"IF('00'!F48=\"\",\"\",'00'!F48)","v":""},{"$f":"SUM(F48:F50)","v":0},null,null,null,null,null,null,"OK",null,"OK"]
[null,{"$f":"IF('00'!B49=\"\",\" -\",'00'!B49)","v":" -"},null,null,null,{"$f":"IF('00'!F49=\"\",\"\",'00'!F49)","v":""},null,null,null,null,null,null,null,"OK",null,"OK"," "]
[null,{"$f":"IF('00'!B50=\"\",\" -\",'00'!B50)","v":" -"},null,null,null,{"$f":"IF('00'!F50=\"\",\"\",'00'!F50)","v":""},null,null,null,null,null,null,null,"OK",null,"OK"]
[null,"Pointage du Travail  ==>  ",null,null,{"$f":"SUM(E17:E50)","v":0},{"$f":"SUM(F17:F50)","v":100},null,null,"Temps = "]
[null,"Pénalités Générales :\n(chiffre négatif)    .",null,null,null,null,null,"Informations sur les pénalités générales :\n   \n   \n   ",null,null,"Classement :",null,null,{"$f":"IF(E52=\"\",\"\",IF(E52>0,\"ATTENTION : 'Pénalité Générales' doit être un nombre négatif ! \",\"OK\"))","v":""}]
[null,"TOTAL GENERAL =",null,null,{"$f":"IF(COUNT(E17:E50)=0,\"-\",E51+E52)","v":"-"},null,null,"Qualificatif :",{"$f":"IF(E53=\"-\",\"-\",IF(E53>89.9999,\"EXCELLENT\",IF(E53>79.9999,\"TRES BON\",IF(E53>69.999,\"BON\",IF(E53>59.999,\"Satisfaisant\",IF(E53>0.1,\"insuffisant \",\"éliminé \"))))))","v":"-"},null,{"$f":"Fiche_organisateur_N°2!P30","v":"X"},{"$f":"'Rapport de Concours'!D40","v":0}]
[null,"CACITR / RCACITR / CACTR / RCACTR :",null,null," -",null,null," <== sur décision du juge "]
[null,"Observations :  ",null,null,null,null,null,null,null,null,null,null,{"$f":"M51+M52","v":0}]
[]
[null,null,null,null,null,null,null,null,"Le Juge :",{"$f":"Fiche_organisateur_N°1!E28","v":0}]

{"sheet":"15","index":22,"n_rows":57,"n_cols":18,"rows_kept":57,"cut":false,"hidden":false,"merged":[[10,8,10,9],[0,10,0,11],[2,1,2,11],[8,8,8,9],[9,8,9,9],[3,2,3,9],[11,8,11,9],[14,4,14,5],[14,7,14,11],[15,1,15,11],[16,1,16,2],[16,3,21,3],[16,6,21,6],[16,7,16,11],[17,1,17,2],[17,7,17,11],[18,1,18,2],[18,7,18,11],[19,1,19,2],[19,7,19,11],[20,1,20,2],[20,7,20,11],[28,1,28,11],[21,1,21,2],[21,7,21,11],[22,1,22,11],[23,1,23,2],[23,3,27,3],[23,6,27,6],[23,7,23,11],[24,1,24,2],[24,7,24,11],[25,1,25,2],[25,7,25,11],[26,1,26,2],[26,7,26,11],[27,1,27,2],[27,7,27,11],[29,1,29,2],[29,3,35,3],[29,6,35,6],[29,7,29,11],[30,1,30,2],[30,7,30,11],[31,1,31,2],[31,7,31,11],[32,1,32,2],[32,7,32,11],[33,1,33,2],[33,7,33,11],[34,1,34,2],[34,7,34,11],[35,1,35,2],[35,7,35,11],[36,1,36,11],[37,1,37,2],[37,3,40,3],[37,6,40,6],[37,7,37,11],[38,1,38,2],[38,7,38,11],[39,1,39,2],[39,7,39,11],[40,1,40,2],[40,7,40,11],[41,1,41,11],[42,1,42,2],[42,3,46,3],[42,6,46,6],[42,7,42,11],[43,1,43,2],[43,7,43,11],[44,1,44,2],[44,7,44,11],[45,1,45,2],[45,7,45,11],[46,1,46,2],[46,7,46,11],[47,1,47,2],[47,3,49,3],[47,6,49,6],[47,7,47,11],[48,1,48,2],[48,7,48,11],[49,1,49,2],[49,7,49,11],[50,1,50,3],[50,9,50,11],[51,1,51,3],[51,7,51,9],[51,10,51,11],[54,1,54,11],[56,9,56,11],[52,1,52,3],[52,4,52,5],[52,8,52,9],[53,1,53,3],[53,4,53,5],[53,7,53,9]]}
[null,null,null,null,null,null,null,null,null,null,{"$f":"Fiche_organisateur_N°1!$E$26","v":"IHT 1"}]
[]
[null,"COMMISSION D'UTILISATION TROUPEAUX"]
[null,null,"Epreuve de travail sur Ovins - TRADITIONAL STYLE "]
[null,"ORGANISATEUR :",{"$f":"Fiche_organisateur_N°1!E15","v":0}]
[null,"Lieu :",{"$f":"Fiche_organisateur_N°1!E16","v":0},null,null,null,null,"Date :",{"$f":"Fiche_organisateur_N°1!$E$13","v":0}]
[null,"Contact :",{"$f":"Fiche_organisateur_N°1!E18","v":0}]
[]
[null,"PROPRIETAIRE :",{"$f":"Fiche_organisateur_N°2!C31","v":0},null,null,null,null,"Race et sexe",{"$f":"Fiche_organisateur_N°2!G31","v":0}]
[null,"CONDUCTEUR :",{"$f":"Fiche_organisateur_N°2!D31","v":0},null,null,null,null,"N° FAPAC :",{"$f":"Fiche_organisateur_N°2!K31","v":0}]
[null,"NOM DU CHIEN :",{"$f":"Fiche_organisateur_N°2!E31","v":0},null,null,null,null,"AFFIXE :",{"$f":"Fiche_organisateur_N°2!F31","v":0}]
[null,null,null,null,null,null,null,"N° d'Identification",{"$f":"Fiche_organisateur_N°2!L31","v":0},null,null,null,null,"Contrôle de saisie (sur les onglets 01 à 20 )"]
[]
[null,null,null,null,null,null,null,null,null,null,null,null,null,"Ces colonnes n'apparaissent pas lors de l'impression…"]
[null,"Epreuves                ",null,null,"Pointages /100",null,null,{"$f":"IF(OR('00'!N51<>30,LEFT('00'!H51,9)=\"ATTENTION\")=1,\"NON VALIDE => corriger la feuille 00 ! ! !\",\"Observations\")","v":"Observations"},null,null,null,null,null,"contrôle-1",null,"contrôle-2"]
[null,{"$f":"IF('00'!B16=\"\",\" -\",'00'!B16)","v":" -"}]
[null,{"$f":"IF('00'!B17=\"\",\" -\",'00'!B17)","v":"Sortie de parc ou bergerie / Exit from the pen "},null,{"$f":"IF('00'!D17=\"\",\"\",'00'!D17)","v":20},null,{"$f":"IF('00'!F17=\"\",\"\",'00'!F17)","v":15},{"$f":"SUM(F17:F22)","v":20},null,null,null,null,null,null,{"$f":"IF(B17=\"\",\"\",IF(E17>F17,\"! ? !\",\"OK\"))","v":"OK"},null,{"$f":"IF(AND(B17=\" -\",E17<>0),\"! ? !\",\"OK\")","v":"OK"}]
[null,{"$f":"IF('00'!B18=\"\",\" -\",'00'!B18)","v":" -"},null,null,null,{"$f":"IF('00'!F18=\"\",\"\",'00'!F18)","v":""},null,null,null,null,null,null,null,"OK",null,"OK",null,"Contrôle-1 : Contrôle que les valeurs entrées ne sont pas supérieures"]
[null,{"$f":"IF('00'!B19=\"\",\" -\",'00'!B19)","v":" -"},null,null,null,{"$f":"IF('00'!F19=\"\",\"\",'00'!F19)","v":""},null,null,null,null,null,null,null,"OK",null,"OK",null,"                    aux pointages maxi attribués à chaque épreuve…"]
[null,{"$f":"IF('00'!B20=\"\",\" -\",'00'!B20)","v":" -"},null,null,null,{"$f":"IF('00'!F20=\"\",\"\",'00'!F20)","v":""},null,null,null,null,null,null,null,"OK",null,"OK"]
[null,{"$f":"IF('00'!B21=\"\",\" -\",'00'!B21)","v":" -"},null,null,null,{"$f":"IF('00'!F21=\"\",\"\",'00'!F21)","v":""},null,null,null,null,null,null,null,"OK",null,"OK"]
[null,{"$f":"IF('00'!B22=\"\",\" -\",'00'!B22)","v":"Rentrée du troupeau  / Re-pen"},null,null,null,{"$f":"IF('00'!F22=\"\",\"\",'00'!F22)","v":5},null,null,null,null,null,null,null,"OK",null,"OK"]
[null,{"$f":"IF('00'!B23=\"\",\" -\",'00'!B23)","v":" -"}]
[null,{"$f":"IF('00'!B24=\"\",\" -\",'00'!B24)","v":"Pont/ Bridge"},null,{"$f":"IF('00'!D24=\"\",\"\",'00'!D24)","v":15},null,{"$f":"IF('00'!F24=\"\",\"\",'00'!F24)","v":5},{"$f":"SUM(F24:F28)","v":15},null,null,null,null,null,null,{"$f":"IF(B24=\"\",\"\",IF(E24>F24,\"! ? !\",\"OK\"))","v":"OK"},null,{"$f":"IF(AND(B24=\" -\",E24<>0),\"! ? !\",\"OK\")","v":"OK"}]
[null,{"$f":"IF('00'!B25=\"\",\" -\",'00'!B25)","v":"obstacle A"},null,null,null,{"$f":"IF('00'!F25=\"\",\"\",'00'!F25)","v":10},null,null,null,null,null,null,null,{"$f":"IF(B25=\"\",\"\",IF(E25>F25,\"! ? !\",\"OK\"))","v":"OK"},null,{"$f":"IF(AND(B25=\" -\",E25<>0),\"! ? !\",\"OK\")","v":"OK"}]
[null,{"$f":"IF('00'!B26=\"\",\" -\",'00'!B26)","v":"Qbstacle B"},null,null,null,{"$f":"IF('00'!F26=\"\",\"\",'00'!F26)","v":""},null,null,null,null,null,null,null,{"$f":"IF(B26=\"\",\"\",IF(E26>F26,\"! ? !\",\"OK\"))","v":"OK"},null,{"$f":"IF(AND(B26=\" -\",E26<>0),\"! ? !\",\"OK\")","v":"OK"}]
[null,{"$f":"IF('00'!B27=\"\",\" -\",'00'!B27)","v":"Obstacle C"},null,null,null,{"$f":"IF('00'!F27=\"\",\"\",'00'!F27)","v":""},null,null,null,null,null,null,null,{"$f":"IF(B27=\"\",\"\",IF(E27>F27,\"! ? !\",\"OK\"))","v":"OK"},null,{"$f":"IF(AND(B27=\" -\",E27<>0),\"! ? !\",\"OK\")","v":"OK"}]
[null,{"$f":"IF('00'!B28=\"\",\" -\",'00'!B28)","v":" -"},null,null,null,{"$f":"IF('00'!F28=\"\",\"\",'00'!F28)","v":""},null,null,null,null,null,null,null,{"$f":"IF(B28=\"\",\"\",IF(E28>F28,\"! ? !\",\"OK\"))","v":"OK"},null,{"$f":"IF(AND(B28=\" -\",E28<>0),\"! ? !\",\"OK\")","v":"OK"}]
[null,{"$f":"IF('00'!B29=\"\",\" -\",'00'!B29)","v":" -"}]
[null,{"$f":"IF('00'!B30=\"\",\" -\",'00'!B30)","v":"Conduite /Moving"},null,{"$f":"IF('00'!D30=\"\",\"\",'00'!D30)","v":45},null,{"$f":"IF('00'!F30=\"\",\"\",'00'!F30)","v":20},{"$f":"SUM(F30:F36)","v":45},null,null,null,null,null,null,{"$f":"IF(B30=\"\",\"\",IF(E30>F30,\"! ? !\",\"OK\"))","v":"OK"},null,{"$f":"IF(AND(B30=\" -\",E30<>0),\"! ? !\",\"OK\")","v":"OK"},null,"Contrôle-2 : Contrôle que les lignes sans épreuve ne contiennent pas de note"]
[null,{"$f":"IF('00'!B31=\"\",\" -\",'00'!B31)","v":"Pâturage / Grazing"},null,null,null,{"$f":"IF('00'!F31=\"\",\"\",'00'!F31)","v":20},null,null,null,null,null,null,null,"OK",null,"OK"]
[null,{"$f":"IF('00'!B32=\"\",\" -\",'00'!B32)","v":"Prise de brebis/ catching sheep and holding a sheep "},null,null,null,{"$f":"IF('00'!F32=\"\",\"\",'00'!F32)","v":5},null,null,null,null,null,null,null,"OK",null,"OK"]
[null,{"$f":"IF('00'!B33=\"\",\" -\",'00'!B33)","v":"Protection de cultures/ Crop protection "},null,null,null,{"$f":"IF('00'!F33=\"\",\"\",'00'!F33)","v":""},null,null,null,null,null,null,null,"OK",null,"OK"]
[null,{"$f":"IF('00'!B34=\"\",\" -\",'00'!B34)","v":"Traffic/ Vehicule "},null,null,null,{"$f":"IF('00'!F34=\"\",\"\",'00'!F34)","v":""},null,null,null,null,null,null,null,"OK",null,"OK"]
[null,{"$f":"IF('00'!B35=\"\",\" -\",'00'!B35)","v":" -"},null,null,null,{"$f":"IF('00'!F35=\"\",\"\",'00'!F35)","v":""},null,null,null,null,null,null,null,"OK",null,"OK"]
[null,{"$f":"IF('00'!B36=\"\",\" -\",'00'!B36)","v":" -"},null,null,null,{"$f":"IF('00'!F36=\"\",\"\",'00'!F36)","v":""},null,null,null,null,null,null,null,"OK",null,"OK"]
[null,{"$f":"IF('00'!B37=\"\",\" -\",'00'!B37)","v":" -"}]
[null,{"$f":"IF('00'!B38=\"\",\" -\",'00'!B38)","v":"Arrêt du troupeau / Stop 1"},null,{"$f":"IF('00'!D38=\"\",\"\",'00'!D38)","v":10},null,{"$f":"IF('00'!F38=\"\",\"\",'00'!F38)","v":10},{"$f":"SUM(F38:F41)","v":10},null,null,null,null,null,null,{"$f":"IF(B38=\"\",\"\",IF(E38>F38,\"! ? !\",\"OK\"))","v":"OK"},null,{"$f":"IF(AND(B38=\" -\",E38<>0),\"! ? !\",\"OK\")","v":"OK"}]
[null,{"$f":"IF('00'!B39=\"\",\" -\",'00'!B39)","v":"Arrêt du troupeau / Stop 2"},null,null,null,{"$f":"IF('00'!F39=\"\",\"\",'00'!F39)","v":""},null,null,null,null,null,null,null,{"$f":"IF(B39=\"\",\"\",IF(E39>F39,\"! ? !\",\"OK\"))","v":"OK"},null,{"$f":"IF(AND(B39=\" -\",E39<>0),\"! ? !\",\"OK\")","v":"OK"}]
[null,{"$f":"IF('00'!B40=\"\",\" -\",'00'!B40)","v":"Arrêt du troupeau / Stop 3"},null,null,null,{"$f":"IF('00'!F40=\"\",\"\",'00'!F40)","v":""},null,null,null,null,null,null,null,{"$f":"IF(B40=\"\",\"\",IF(E40>F40,\"! ? !\",\"OK\"))","v":"OK"},null,{"$f":"IF(AND(B40=\" -\",E40<>0),\"! ? !\",\"OK\")","v":"OK"}]
[null,{"$f":"IF('00'!B41=\"\",\" -\",'00'!B41)","v":" -"},null,null,null,{"$f":"IF('00'!F41=\"\",\"\",'00'!F41)","v":""},null,null,null,null,null,null,null,{"$f":"IF(B41=\"\",\"\",IF(E41>F41,\"! ? !\",\"OK\"))","v":"OK"},null,{"$f":"IF(AND(B41=\" -\",E41<>0),\"! ? !\",\"OK\")","v":"OK"}]
[null,{"$f":"IF('00'!B42=\"\",\" -\",'00'!B42)","v":" -"}]
[null,{"$f":"IF('00'!B43=\"\",\" -\",'00'!B43)","v":"Aptitude naturelle / Natural ability "},null,{"$f":"IF('00'!D43=\"\",\"\",'00'!D43)","v":10},null,{"$f":"IF('00'!F43=\"\",\"\",'00'!F43)","v":3},{"$f":"SUM(F43:F47)","v":10},null,null,null,null,null,null,{"$f":"IF(B43=\"\",\"\",IF(E43>F43,\"! ? !\",\"OK\"))","v":"OK"},null,{"$f":"IF(AND(B43=\" -\",E43<>0),\"! ? !\",\"OK\")","v":"OK"}]
[null,{"$f":"IF('00'!B44=\"\",\" -\",'00'!B44)","v":"Absence d’agressivité/ gentleness "},null,null,null,{"$f":"IF('00'!F44=\"\",\"\",'00'!F44)","v":2},null,null,null,null,null,null,null,"OK",null,"OK"]
[null,{"$f":"IF('00'!B45=\"\",\" -\",'00'!B45)","v":"Intelligence d’exécution/ Intelligence of execution  "},null,null,null,{"$f":"IF('00'!F45=\"\",\"\",'00'!F45)","v":2},null,null,null,null,null,null,null,"OK",null,"OK"]
[null,{"$f":"IF('00'!B46=\"\",\" -\",'00'!B46)","v":"Obéissance / Obedience "},null,null,null,{"$f":"IF('00'!F46=\"\",\"\",'00'!F46)","v":3},null,null,null,null,null,null,null,"OK",null,"OK"]
[null,{"$f":"IF('00'!B47=\"\",\" -\",'00'!B47)","v":" -"},null,null,null,{"$f":"IF('00'!F47=\"\",\"\",'00'!F47)","v":""},null,null,null,null,null,null,null,"OK",null,"OK"]
[null,{"$f":"IF('00'!B48=\"\",\" -\",'00'!B48)","v":" -"},null,{"$f":"IF('00'!D48=\"\",\"\",'00'!D48)","v":""},null,{"$f":"IF('00'!F48=\"\",\"\",'00'!F48)","v":""},{"$f":"SUM(F48:F50)","v":0},null,null,null,null,null,null,"OK",null,"OK"]
[null,{"$f":"IF('00'!B49=\"\",\" -\",'00'!B49)","v":" -"},null,null,null,{"$f":"IF('00'!F49=\"\",\"\",'00'!F49)","v":""},null,null,null,null,null,null,null,"OK",null,"OK"," "]
[null,{"$f":"IF('00'!B50=\"\",\" -\",'00'!B50)","v":" -"},null,null,null,{"$f":"IF('00'!F50=\"\",\"\",'00'!F50)","v":""},null,null,null,null,null,null,null,"OK",null,"OK"]
[null,"Pointage du Travail  ==>  ",null,null,{"$f":"SUM(E17:E50)","v":0},{"$f":"SUM(F17:F50)","v":100},null,null,"Temps = "]
[null,"Pénalités Générales :\n(chiffre négatif)    .",null,null,null,null,null,"Informations sur les pénalités générales :\n   \n   \n   ",null,null,"Classement :",null,null,{"$f":"IF(E52=\"\",\"\",IF(E52>0,\"ATTENTION : 'Pénalité Générales' doit être un nombre négatif ! \",\"OK\"))","v":""}]
[null,"TOTAL GENERAL =",null,null,{"$f":"IF(COUNT(E17:E50)=0,\"-\",E51+E52)","v":"-"},null,null,"Qualificatif :",{"$f":"IF(E53=\"-\",\"-\",IF(E53>89.9999,\"EXCELLENT\",IF(E53>79.9999,\"TRES BON\",IF(E53>69.999,\"BON\",IF(E53>59.999,\"Satisfaisant\",IF(E53>0.1,\"insuffisant \",\"éliminé \"))))))","v":"-"},null,{"$f":"Fiche_organisateur_N°2!P31","v":"X"},{"$f":"'Rapport de Concours'!D40","v":0}]
[null,"CACITR / RCACITR / CACTR / RCACTR :",null,null," -",null,null," <== sur décision du juge "]
[null,"Observations :  ",null,null,null,null,null,null,null,null,null,null,{"$f":"M51+M52","v":0}]
[]
[null,null,null,null,null,null,null,null,"Le Juge :",{"$f":"Fiche_organisateur_N°1!E28","v":0}]

{"sheet":"16","index":23,"n_rows":57,"n_cols":18,"rows_kept":57,"cut":false,"hidden":false,"merged":[[10,8,10,9],[0,10,0,11],[2,1,2,11],[8,8,8,9],[9,8,9,9],[3,2,3,9],[11,8,11,9],[14,4,14,5],[14,7,14,11],[15,1,15,11],[16,1,16,2],[16,3,21,3],[16,6,21,6],[16,7,16,11],[17,1,17,2],[17,7,17,11],[18,1,18,2],[18,7,18,11],[19,1,19,2],[19,7,19,11],[20,1,20,2],[20,7,20,11],[28,1,28,11],[21,1,21,2],[21,7,21,11],[22,1,22,11],[23,1,23,2],[23,3,27,3],[23,6,27,6],[23,7,23,11],[24,1,24,2],[24,7,24,11],[25,1,25,2],[25,7,25,11],[26,1,26,2],[26,7,26,11],[27,1,27,2],[27,7,27,11],[29,1,29,2],[29,3,35,3],[29,6,35,6],[29,7,29,11],[30,1,30,2],[30,7,30,11],[31,1,31,2],[31,7,31,11],[32,1,32,2],[32,7,32,11],[33,1,33,2],[33,7,33,11],[34,1,34,2],[34,7,34,11],[35,1,35,2],[35,7,35,11],[36,1,36,11],[37,1,37,2],[37,3,40,3],[37,6,40,6],[37,7,37,11],[38,1,38,2],[38,7,38,11],[39,1,39,2],[39,7,39,11],[40,1,40,2],[40,7,40,11],[41,1,41,11],[42,1,42,2],[42,3,46,3],[42,6,46,6],[42,7,42,11],[43,1,43,2],[43,7,43,11],[44,1,44,2],[44,7,44,11],[45,1,45,2],[45,7,45,11],[46,1,46,2],[46,7,46,11],[47,1,47,2],[47,3,49,3],[47,6,49,6],[47,7,47,11],[48,1,48,2],[48,7,48,11],[49,1,49,2],[49,7,49,11],[50,1,50,3],[50,9,50,11],[51,1,51,3],[51,7,51,9],[51,10,51,11],[54,1,54,11],[56,9,56,11],[52,1,52,3],[52,4,52,5],[52,8,52,9],[53,1,53,3],[53,4,53,5],[53,7,53,9]]}
[null,null,null,null,null,null,null,null,null,null,{"$f":"Fiche_organisateur_N°1!$E$26","v":"IHT 1"}]
[]
[null,"COMMISSION D'UTILISATION TROUPEAUX"]
[null,null,"Epreuve de travail sur Ovins - TRADITIONAL STYLE "]
[null,"ORGANISATEUR :",{"$f":"Fiche_organisateur_N°1!E15","v":0}]
[null,"Lieu :",{"$f":"Fiche_organisateur_N°1!E16","v":0},null,null,null,null,"Date :",{"$f":"Fiche_organisateur_N°1!$E$13","v":0}]
[null,"Contact :",{"$f":"Fiche_organisateur_N°1!E18","v":0}]
[]
[null,"PROPRIETAIRE :",{"$f":"Fiche_organisateur_N°2!C32","v":0},null,null,null,null,"Race et sexe",{"$f":"Fiche_organisateur_N°2!G32","v":0}]
[null,"CONDUCTEUR :",{"$f":"Fiche_organisateur_N°2!D32","v":0},null,null,null,null,"N° FAPAC :",{"$f":"Fiche_organisateur_N°2!K32","v":0}]
[null,"NOM DU CHIEN :",{"$f":"Fiche_organisateur_N°2!E32","v":0},null,null,null,null,"AFFIXE :",{"$f":"Fiche_organisateur_N°2!F32","v":0}]
[null,null,null,null,null,null,null,"N° d'Identification",{"$f":"Fiche_organisateur_N°2!L32","v":0},null,null,null,null,"Contrôle de saisie (sur les onglets 01 à 20 )"]
[]
[null,null,null,null,null,null,null,null,null,null,null,null,null,"Ces colonnes n'apparaissent pas lors de l'impression…"]
[null,"Epreuves                ",null,null,"Pointages /100",null,null,{"$f":"IF(OR('00'!N51<>30,LEFT('00'!H51,9)=\"ATTENTION\")=1,\"NON VALIDE => corriger la feuille 00 ! ! !\",\"Observations\")","v":"Observations"},null,null,null,null,null,"contrôle-1",null,"contrôle-2"]
[null,{"$f":"IF('00'!B16=\"\",\" -\",'00'!B16)","v":" -"}]
[null,{"$f":"IF('00'!B17=\"\",\" -\",'00'!B17)","v":"Sortie de parc ou bergerie / Exit from the pen "},null,{"$f":"IF('00'!D17=\"\",\"\",'00'!D17)","v":20},null,{"$f":"IF('00'!F17=\"\",\"\",'00'!F17)","v":15},{"$f":"SUM(F17:F22)","v":20},null,null,null,null,null,null,{"$f":"IF(B17=\"\",\"\",IF(E17>F17,\"! ? !\",\"OK\"))","v":"OK"},null,{"$f":"IF(AND(B17=\" -\",E17<>0),\"! ? !\",\"OK\")","v":"OK"}]
[null,{"$f":"IF('00'!B18=\"\",\" -\",'00'!B18)","v":" -"},null,null,null,{"$f":"IF('00'!F18=\"\",\"\",'00'!F18)","v":""},null,null,null,null,null,null,null,"OK",null,"OK",null,"Contrôle-1 : Contrôle que les valeurs entrées ne sont pas supérieures"]
[null,{"$f":"IF('00'!B19=\"\",\" -\",'00'!B19)","v":" -"},null,null,null,{"$f":"IF('00'!F19=\"\",\"\",'00'!F19)","v":""},null,null,null,null,null,null,null,"OK",null,"OK",null,"                    aux pointages maxi attribués à chaque épreuve…"]
[null,{"$f":"IF('00'!B20=\"\",\" -\",'00'!B20)","v":" -"},null,null,null,{"$f":"IF('00'!F20=\"\",\"\",'00'!F20)","v":""},null,null,null,null,null,null,null,"OK",null,"OK"]
[null,{"$f":"IF('00'!B21=\"\",\" -\",'00'!B21)","v":" -"},null,null,null,{"$f":"IF('00'!F21=\"\",\"\",'00'!F21)","v":""},null,null,null,null,null,null,null,"OK",null,"OK"]
[null,{"$f":"IF('00'!B22=\"\",\" -\",'00'!B22)","v":"Rentrée du troupeau  / Re-pen"},null,null,null,{"$f":"IF('00'!F22=\"\",\"\",'00'!F22)","v":5},null,null,null,null,null,null,null,"OK",null,"OK"]
[null,{"$f":"IF('00'!B23=\"\",\" -\",'00'!B23)","v":" -"}]
[null,{"$f":"IF('00'!B24=\"\",\" -\",'00'!B24)","v":"Pont/ Bridge"},null,{"$f":"IF('00'!D24=\"\",\"\",'00'!D24)","v":15},null,{"$f":"IF('00'!F24=\"\",\"\",'00'!F24)","v":5},{"$f":"SUM(F24:F28)","v":15},null,null,null,null,null,null,{"$f":"IF(B24=\"\",\"\",IF(E24>F24,\"! ? !\",\"OK\"))","v":"OK"},null,{"$f":"IF(AND(B24=\" -\",E24<>0),\"! ? !\",\"OK\")","v":"OK"}]
[null,{"$f":"IF('00'!B25=\"\",\" -\",'00'!B25)","v":"obstacle A"},null,null,null,{"$f":"IF('00'!F25=\"\",\"\",'00'!F25)","v":10},null,null,null,null,null,null,null,{"$f":"IF(B25=\"\",\"\",IF(E25>F25,\"! ? !\",\"OK\"))","v":"OK"},null,{"$f":"IF(AND(B25=\" -\",E25<>0),\"! ? !\",\"OK\")","v":"OK"}]
[null,{"$f":"IF('00'!B26=\"\",\" -\",'00'!B26)","v":"Qbstacle B"},null,null,null,{"$f":"IF('00'!F26=\"\",\"\",'00'!F26)","v":""},null,null,null,null,null,null,null,{"$f":"IF(B26=\"\",\"\",IF(E26>F26,\"! ? !\",\"OK\"))","v":"OK"},null,{"$f":"IF(AND(B26=\" -\",E26<>0),\"! ? !\",\"OK\")","v":"OK"}]
[null,{"$f":"IF('00'!B27=\"\",\" -\",'00'!B27)","v":"Obstacle C"},null,null,null,{"$f":"IF('00'!F27=\"\",\"\",'00'!F27)","v":""},null,null,null,null,null,null,null,{"$f":"IF(B27=\"\",\"\",IF(E27>F27,\"! ? !\",\"OK\"))","v":"OK"},null,{"$f":"IF(AND(B27=\" -\",E27<>0),\"! ? !\",\"OK\")","v":"OK"}]
[null,{"$f":"IF('00'!B28=\"\",\" -\",'00'!B28)","v":" -"},null,null,null,{"$f":"IF('00'!F28=\"\",\"\",'00'!F28)","v":""},null,null,null,null,null,null,null,{"$f":"IF(B28=\"\",\"\",IF(E28>F28,\"! ? !\",\"OK\"))","v":"OK"},null,{"$f":"IF(AND(B28=\" -\",E28<>0),\"! ? !\",\"OK\")","v":"OK"}]
[null,{"$f":"IF('00'!B29=\"\",\" -\",'00'!B29)","v":" -"}]
[null,{"$f":"IF('00'!B30=\"\",\" -\",'00'!B30)","v":"Conduite /Moving"},null,{"$f":"IF('00'!D30=\"\",\"\",'00'!D30)","v":45},null,{"$f":"IF('00'!F30=\"\",\"\",'00'!F30)","v":20},{"$f":"SUM(F30:F36)","v":45},null,null,null,null,null,null,{"$f":"IF(B30=\"\",\"\",IF(E30>F30,\"! ? !\",\"OK\"))","v":"OK"},null,{"$f":"IF(AND(B30=\" -\",E30<>0),\"! ? !\",\"OK\")","v":"OK"},null,"Contrôle-2 : Contrôle que les lignes sans épreuve ne contiennent pas de note"]
[null,{"$f":"IF('00'!B31=\"\",\" -\",'00'!B31)","v":"Pâturage / Grazing"},null,null,null,{"$f":"IF('00'!F31=\"\",\"\",'00'!F31)","v":20},null,null,null,null,null,null,null,"OK",null,"OK"]
[null,{"$f":"IF('00'!B32=\"\",\" -\",'00'!B32)","v":"Prise de brebis/ catching sheep and holding a sheep "},null,null,null,{"$f":"IF('00'!F32=\"\",\"\",'00'!F32)","v":5},null,null,null,null,null,null,null,"OK",null,"OK"]
[null,{"$f":"IF('00'!B33=\"\",\" -\",'00'!B33)","v":"Protection de cultures/ Crop protection "},null,null,null,{"$f":"IF('00'!F33=\"\",\"\",'00'!F33)","v":""},null,null,null,null,null,null,null,"OK",null,"OK"]
[null,{"$f":"IF('00'!B34=\"\",\" -\",'00'!B34)","v":"Traffic/ Vehicule "},null,null,null,{"$f":"IF('00'!F34=\"\",\"\",'00'!F34)","v":""},null,null,null,null,null,null,null,"OK",null,"OK"]
[null,{"$f":"IF('00'!B35=\"\",\" -\",'00'!B35)","v":" -"},null,null,null,{"$f":"IF('00'!F35=\"\",\"\",'00'!F35)","v":""},null,null,null,null,null,null,null,"OK",null,"OK"]
[null,{"$f":"IF('00'!B36=\"\",\" -\",'00'!B36)","v":" -"},null,null,null,{"$f":"IF('00'!F36=\"\",\"\",'00'!F36)","v":""},null,null,null,null,null,null,null,"OK",null,"OK"]
[null,{"$f":"IF('00'!B37=\"\",\" -\",'00'!B37)","v":" -"}]
[null,{"$f":"IF('00'!B38=\"\",\" -\",'00'!B38)","v":"Arrêt du troupeau / Stop 1"},null,{"$f":"IF('00'!D38=\"\",\"\",'00'!D38)","v":10},null,{"$f":"IF('00'!F38=\"\",\"\",'00'!F38)","v":10},{"$f":"SUM(F38:F41)","v":10},null,null,null,null,null,null,{"$f":"IF(B38=\"\",\"\",IF(E38>F38,\"! ? !\",\"OK\"))","v":"OK"},null,{"$f":"IF(AND(B38=\" -\",E38<>0),\"! ? !\",\"OK\")","v":"OK"}]
[null,{"$f":"IF('00'!B39=\"\",\" -\",'00'!B39)","v":"Arrêt du troupeau / Stop 2"},null,null,null,{"$f":"IF('00'!F39=\"\",\"\",'00'!F39)","v":""},null,null,null,null,null,null,null,{"$f":"IF(B39=\"\",\"\",IF(E39>F39,\"! ? !\",\"OK\"))","v":"OK"},null,{"$f":"IF(AND(B39=\" -\",E39<>0),\"! ? !\",\"OK\")","v":"OK"}]
[null,{"$f":"IF('00'!B40=\"\",\" -\",'00'!B40)","v":"Arrêt du troupeau / Stop 3"},null,null,null,{"$f":"IF('00'!F40=\"\",\"\",'00'!F40)","v":""},null,null,null,null,null,null,null,{"$f":"IF(B40=\"\",\"\",IF(E40>F40,\"! ? !\",\"OK\"))","v":"OK"},null,{"$f":"IF(AND(B40=\" -\",E40<>0),\"! ? !\",\"OK\")","v":"OK"}]
[null,{"$f":"IF('00'!B41=\"\",\" -\",'00'!B41)","v":" -"},null,null,null,{"$f":"IF('00'!F41=\"\",\"\",'00'!F41)","v":""},null,null,null,null,null,null,null,{"$f":"IF(B41=\"\",\"\",IF(E41>F41,\"! ? !\",\"OK\"))","v":"OK"},null,{"$f":"IF(AND(B41=\" -\",E41<>0),\"! ? !\",\"OK\")","v":"OK"}]
[null,{"$f":"IF('00'!B42=\"\",\" -\",'00'!B42)","v":" -"}]
[null,{"$f":"IF('00'!B43=\"\",\" -\",'00'!B43)","v":"Aptitude naturelle / Natural ability "},null,{"$f":"IF('00'!D43=\"\",\"\",'00'!D43)","v":10},null,{"$f":"IF('00'!F43=\"\",\"\",'00'!F43)","v":3},{"$f":"SUM(F43:F47)","v":10},null,null,null,null,null,null,{"$f":"IF(B43=\"\",\"\",IF(E43>F43,\"! ? !\",\"OK\"))","v":"OK"},null,{"$f":"IF(AND(B43=\" -\",E43<>0),\"! ? !\",\"OK\")","v":"OK"}]
[null,{"$f":"IF('00'!B44=\"\",\" -\",'00'!B44)","v":"Absence d’agressivité/ gentleness "},null,null,null,{"$f":"IF('00'!F44=\"\",\"\",'00'!F44)","v":2},null,null,null,null,null,null,null,"OK",null,"OK"]
[null,{"$f":"IF('00'!B45=\"\",\" -\",'00'!B45)","v":"Intelligence d’exécution/ Intelligence of execution  "},null,null,null,{"$f":"IF('00'!F45=\"\",\"\",'00'!F45)","v":2},null,null,null,null,null,null,null,"OK",null,"OK"]
[null,{"$f":"IF('00'!B46=\"\",\" -\",'00'!B46)","v":"Obéissance / Obedience "},null,null,null,{"$f":"IF('00'!F46=\"\",\"\",'00'!F46)","v":3},null,null,null,null,null,null,null,"OK",null,"OK"]
[null,{"$f":"IF('00'!B47=\"\",\" -\",'00'!B47)","v":" -"},null,null,null,{"$f":"IF('00'!F47=\"\",\"\",'00'!F47)","v":""},null,null,null,null,null,null,null,"OK",null,"OK"]
[null,{"$f":"IF('00'!B48=\"\",\" -\",'00'!B48)","v":" -"},null,{"$f":"IF('00'!D48=\"\",\"\",'00'!D48)","v":""},null,{"$f":"IF('00'!F48=\"\",\"\",'00'!F48)","v":""},{"$f":"SUM(F48:F50)","v":0},null,null,null,null,null,null,"OK",null,"OK"]
[null,{"$f":"IF('00'!B49=\"\",\" -\",'00'!B49)","v":" -"},null,null,null,{"$f":"IF('00'!F49=\"\",\"\",'00'!F49)","v":""},null,null,null,null,null,null,null,"OK",null,"OK"," "]
[null,{"$f":"IF('00'!B50=\"\",\" -\",'00'!B50)","v":" -"},null,null,null,{"$f":"IF('00'!F50=\"\",\"\",'00'!F50)","v":""},null,null,null,null,null,null,null,"OK",null,"OK"]
[null,"Pointage du Travail  ==>  ",null,null,{"$f":"SUM(E17:E50)","v":0},{"$f":"SUM(F17:F50)","v":100},null,null,"Temps = "]
[null,"Pénalités Générales :\n(chiffre négatif)    .",null,null,null,null,null,"Informations sur les pénalités générales :\n   \n   \n   ",null,null,"Classement :",null,null,{"$f":"IF(E52=\"\",\"\",IF(E52>0,\"ATTENTION : 'Pénalité Générales' doit être un nombre négatif ! \",\"OK\"))","v":""}]
[null,"TOTAL GENERAL =",null,null,{"$f":"IF(COUNT(E17:E50)=0,\"-\",E51+E52)","v":"-"},null,null,"Qualificatif :",{"$f":"IF(E53=\"-\",\"-\",IF(E53>89.9999,\"EXCELLENT\",IF(E53>79.9999,\"TRES BON\",IF(E53>69.999,\"BON\",IF(E53>59.999,\"Satisfaisant\",IF(E53>0.1,\"insuffisant \",\"éliminé \"))))))","v":"-"},null,{"$f":"Fiche_organisateur_N°2!P32","v":"X"},{"$f":"'Rapport de Concours'!D40","v":0}]
[null,"CACITR / RCACITR / CACTR / RCACTR :",null,null," -",null,null," <== sur décision du juge "]
[null,"Observations :  ",null,null,null,null,null,null,null,null,null,null,{"$f":"M51+M52","v":0}]
[]
[null,null,null,null,null,null,null,null,"Le Juge :",{"$f":"Fiche_organisateur_N°1!E28","v":0}]

{"sheet":"17","index":24,"n_rows":57,"n_cols":18,"rows_kept":57,"cut":false,"hidden":false,"merged":[[10,8,10,9],[0,10,0,11],[2,1,2,11],[8,8,8,9],[9,8,9,9],[3,2,3,9],[11,8,11,9],[14,4,14,5],[14,7,14,11],[15,1,15,11],[16,1,16,2],[16,3,21,3],[16,6,21,6],[16,7,16,11],[17,1,17,2],[17,7,17,11],[18,1,18,2],[18,7,18,11],[19,1,19,2],[19,7,19,11],[20,1,20,2],[20,7,20,11],[28,1,28,11],[21,1,21,2],[21,7,21,11],[22,1,22,11],[23,1,23,2],[23,3,27,3],[23,6,27,6],[23,7,23,11],[24,1,24,2],[24,7,24,11],[25,1,25,2],[25,7,25,11],[26,1,26,2],[26,7,26,11],[27,1,27,2],[27,7,27,11],[29,1,29,2],[29,3,35,3],[29,6,35,6],[29,7,29,11],[30,1,30,2],[30,7,30,11],[31,1,31,2],[31,7,31,11],[32,1,32,2],[32,7,32,11],[33,1,33,2],[33,7,33,11],[34,1,34,2],[34,7,34,11],[35,1,35,2],[35,7,35,11],[36,1,36,11],[37,1,37,2],[37,3,40,3],[37,6,40,6],[37,7,37,11],[38,1,38,2],[38,7,38,11],[39,1,39,2],[39,7,39,11],[40,1,40,2],[40,7,40,11],[41,1,41,11],[42,1,42,2],[42,3,46,3],[42,6,46,6],[42,7,42,11],[43,1,43,2],[43,7,43,11],[44,1,44,2],[44,7,44,11],[45,1,45,2],[45,7,45,11],[46,1,46,2],[46,7,46,11],[47,1,47,2],[47,3,49,3],[47,6,49,6],[47,7,47,11],[48,1,48,2],[48,7,48,11],[49,1,49,2],[49,7,49,11],[50,1,50,3],[50,9,50,11],[51,1,51,3],[51,7,51,9],[51,10,51,11],[54,1,54,11],[56,9,56,11],[52,1,52,3],[52,4,52,5],[52,8,52,9],[53,1,53,3],[53,4,53,5],[53,7,53,9]]}
[null,null,null,null,null,null,null,null,null,null,{"$f":"Fiche_organisateur_N°1!$E$26","v":"IHT 1"}]
[]
[null,"COMMISSION D'UTILISATION TROUPEAUX"]
[null,null,"Epreuve de travail sur Ovins - TRADITIONAL STYLE "]
[null,"ORGANISATEUR :",{"$f":"Fiche_organisateur_N°1!E15","v":0}]
[null,"Lieu :",{"$f":"Fiche_organisateur_N°1!E16","v":0},null,null,null,null,"Date :",{"$f":"Fiche_organisateur_N°1!$E$13","v":0}]
[null,"Contact :",{"$f":"Fiche_organisateur_N°1!E18","v":0}]
[]
[null,"PROPRIETAIRE :",{"$f":"Fiche_organisateur_N°2!C33","v":0},null,null,null,null,"Race et sexe",{"$f":"Fiche_organisateur_N°2!G33","v":0}]
[null,"CONDUCTEUR :",{"$f":"Fiche_organisateur_N°2!D33","v":0},null,null,null,null,"N° FAPAC :",{"$f":"Fiche_organisateur_N°2!K33","v":0}]
[null,"NOM DU CHIEN :",{"$f":"Fiche_organisateur_N°2!E33","v":0},null,null,null,null,"AFFIXE :",{"$f":"Fiche_organisateur_N°2!F33","v":0}]
[null,null,null,null,null,null,null,"N° d'Identification",{"$f":"Fiche_organisateur_N°2!L33","v":0},null,null,null,null,"Contrôle de saisie (sur les onglets 01 à 20 )"]
[]
[null,null,null,null,null,null,null,null,null,null,null,null,null,"Ces colonnes n'apparaissent pas lors de l'impression…"]
[null,"Epreuves                ",null,null,"Pointages /100",null,null,{"$f":"IF(OR('00'!N51<>30,LEFT('00'!H51,9)=\"ATTENTION\")=1,\"NON VALIDE => corriger la feuille 00 ! ! !\",\"Observations\")","v":"Observations"},null,null,null,null,null,"contrôle-1",null,"contrôle-2"]
[null,{"$f":"IF('00'!B16=\"\",\" -\",'00'!B16)","v":" -"}]
[null,{"$f":"IF('00'!B17=\"\",\" -\",'00'!B17)","v":"Sortie de parc ou bergerie / Exit from the pen "},null,{"$f":"IF('00'!D17=\"\",\"\",'00'!D17)","v":20},null,{"$f":"IF('00'!F17=\"\",\"\",'00'!F17)","v":15},{"$f":"SUM(F17:F22)","v":20},null,null,null,null,null,null,{"$f":"IF(B17=\"\",\"\",IF(E17>F17,\"! ? !\",\"OK\"))","v":"OK"},null,{"$f":"IF(AND(B17=\" -\",E17<>0),\"! ? !\",\"OK\")","v":"OK"}]
[null,{"$f":"IF('00'!B18=\"\",\" -\",'00'!B18)","v":" -"},null,null,null,{"$f":"IF('00'!F18=\"\",\"\",'00'!F18)","v":""},null,null,null,null,null,null,null,"OK",null,"OK",null,"Contrôle-1 : Contrôle que les valeurs entrées ne sont pas supérieures"]
[null,{"$f":"IF('00'!B19=\"\",\" -\",'00'!B19)","v":" -"},null,null,null,{"$f":"IF('00'!F19=\"\",\"\",'00'!F19)","v":""},null,null,null,null,null,null,null,"OK",null,"OK",null,"                    aux pointages maxi attribués à chaque épreuve…"]
[null,{"$f":"IF('00'!B20=\"\",\" -\",'00'!B20)","v":" -"},null,null,null,{"$f":"IF('00'!F20=\"\",\"\",'00'!F20)","v":""},null,null,null,null,null,null,null,"OK",null,"OK"]
[null,{"$f":"IF('00'!B21=\"\",\" -\",'00'!B21)","v":" -"},null,null,null,{"$f":"IF('00'!F21=\"\",\"\",'00'!F21)","v":""},null,null,null,null,null,null,null,"OK",null,"OK"]
[null,{"$f":"IF('00'!B22=\"\",\" -\",'00'!B22)","v":"Rentrée du troupeau  / Re-pen"},null,null,null,{"$f":"IF('00'!F22=\"\",\"\",'00'!F22)","v":5},null,null,null,null,null,null,null,"OK",null,"OK"]
[null,{"$f":"IF('00'!B23=\"\",\" -\",'00'!B23)","v":" -"}]
[null,{"$f":"IF('00'!B24=\"\",\" -\",'00'!B24)","v":"Pont/ Bridge"},null,{"$f":"IF('00'!D24=\"\",\"\",'00'!D24)","v":15},null,{"$f":"IF('00'!F24=\"\",\"\",'00'!F24)","v":5},{"$f":"SUM(F24:F28)","v":15},null,null,null,null,null,null,{"$f":"IF(B24=\"\",\"\",IF(E24>F24,\"! ? !\",\"OK\"))","v":"OK"},null,{"$f":"IF(AND(B24=\" -\",E24<>0),\"! ? !\",\"OK\")","v":"OK"}]
[null,{"$f":"IF('00'!B25=\"\",\" -\",'00'!B25)","v":"obstacle A"},null,null,null,{"$f":"IF('00'!F25=\"\",\"\",'00'!F25)","v":10},null,null,null,null,null,null,null,{"$f":"IF(B25=\"\",\"\",IF(E25>F25,\"! ? !\",\"OK\"))","v":"OK"},null,{"$f":"IF(AND(B25=\" -\",E25<>0),\"! ? !\",\"OK\")","v":"OK"}]
[null,{"$f":"IF('00'!B26=\"\",\" -\",'00'!B26)","v":"Qbstacle B"},null,null,null,{"$f":"IF('00'!F26=\"\",\"\",'00'!F26)","v":""},null,null,null,null,null,null,null,{"$f":"IF(B26=\"\",\"\",IF(E26>F26,\"! ? !\",\"OK\"))","v":"OK"},null,{"$f":"IF(AND(B26=\" -\",E26<>0),\"! ? !\",\"OK\")","v":"OK"}]
[null,{"$f":"IF('00'!B27=\"\",\" -\",'00'!B27)","v":"Obstacle C"},null,null,null,{"$f":"IF('00'!F27=\"\",\"\",'00'!F27)","v":""},null,null,null,null,null,null,null,{"$f":"IF(B27=\"\",\"\",IF(E27>F27,\"! ? !\",\"OK\"))","v":"OK"},null,{"$f":"IF(AND(B27=\" -\",E27<>0),\"! ? !\",\"OK\")","v":"OK"}]
[null,{"$f":"IF('00'!B28=\"\",\" -\",'00'!B28)","v":" -"},null,null,null,{"$f":"IF('00'!F28=\"\",\"\",'00'!F28)","v":""},null,null,null,null,null,null,null,{"$f":"IF(B28=\"\",\"\",IF(E28>F28,\"! ? !\",\"OK\"))","v":"OK"},null,{"$f":"IF(AND(B28=\" -\",E28<>0),\"! ? !\",\"OK\")","v":"OK"}]
[null,{"$f":"IF('00'!B29=\"\",\" -\",'00'!B29)","v":" -"}]
[null,{"$f":"IF('00'!B30=\"\",\" -\",'00'!B30)","v":"Conduite /Moving"},null,{"$f":"IF('00'!D30=\"\",\"\",'00'!D30)","v":45},null,{"$f":"IF('00'!F30=\"\",\"\",'00'!F30)","v":20},{"$f":"SUM(F30:F36)","v":45},null,null,null,null,null,null,{"$f":"IF(B30=\"\",\"\",IF(E30>F30,\"! ? !\",\"OK\"))","v":"OK"},null,{"$f":"IF(AND(B30=\" -\",E30<>0),\"! ? !\",\"OK\")","v":"OK"},null,"Contrôle-2 : Contrôle que les lignes sans épreuve ne contiennent pas de note"]
[null,{"$f":"IF('00'!B31=\"\",\" -\",'00'!B31)","v":"Pâturage / Grazing"},null,null,null,{"$f":"IF('00'!F31=\"\",\"\",'00'!F31)","v":20},null,null,null,null,null,null,null,"OK",null,"OK"]
[null,{"$f":"IF('00'!B32=\"\",\" -\",'00'!B32)","v":"Prise de brebis/ catching sheep and holding a sheep "},null,null,null,{"$f":"IF('00'!F32=\"\",\"\",'00'!F32)","v":5},null,null,null,null,null,null,null,"OK",null,"OK"]
[null,{"$f":"IF('00'!B33=\"\",\" -\",'00'!B33)","v":"Protection de cultures/ Crop protection "},null,null,null,{"$f":"IF('00'!F33=\"\",\"\",'00'!F33)","v":""},null,null,null,null,null,null,null,"OK",null,"OK"]
[null,{"$f":"IF('00'!B34=\"\",\" -\",'00'!B34)","v":"Traffic/ Vehicule "},null,null,null,{"$f":"IF('00'!F34=\"\",\"\",'00'!F34)","v":""},null,null,null,null,null,null,null,"OK",null,"OK"]
[null,{"$f":"IF('00'!B35=\"\",\" -\",'00'!B35)","v":" -"},null,null,null,{"$f":"IF('00'!F35=\"\",\"\",'00'!F35)","v":""},null,null,null,null,null,null,null,"OK",null,"OK"]
[null,{"$f":"IF('00'!B36=\"\",\" -\",'00'!B36)","v":" -"},null,null,null,{"$f":"IF('00'!F36=\"\",\"\",'00'!F36)","v":""},null,null,null,null,null,null,null,"OK",null,"OK"]
[null,{"$f":"IF('00'!B37=\"\",\" -\",'00'!B37)","v":" -"}]
[null,{"$f":"IF('00'!B38=\"\",\" -\",'00'!B38)","v":"Arrêt du troupeau / Stop 1"},null,{"$f":"IF('00'!D38=\"\",\"\",'00'!D38)","v":10},null,{"$f":"IF('00'!F38=\"\",\"\",'00'!F38)","v":10},{"$f":"SUM(F38:F41)","v":10},null,null,null,null,null,null,{"$f":"IF(B38=\"\",\"\",IF(E38>F38,\"! ? !\",\"OK\"))","v":"OK"},null,{"$f":"IF(AND(B38=\" -\",E38<>0),\"! ? !\",\"OK\")","v":"OK"}]
[null,{"$f":"IF('00'!B39=\"\",\" -\",'00'!B39)","v":"Arrêt du troupeau / Stop 2"},null,null,null,{"$f":"IF('00'!F39=\"\",\"\",'00'!F39)","v":""},null,null,null,null,null,null,null,{"$f":"IF(B39=\"\",\"\",IF(E39>F39,\"! ? !\",\"OK\"))","v":"OK"},null,{"$f":"IF(AND(B39=\" -\",E39<>0),\"! ? !\",\"OK\")","v":"OK"}]
[null,{"$f":"IF('00'!B40=\"\",\" -\",'00'!B40)","v":"Arrêt du troupeau / Stop 3"},null,null,null,{"$f":"IF('00'!F40=\"\",\"\",'00'!F40)","v":""},null,null,null,null,null,null,null,{"$f":"IF(B40=\"\",\"\",IF(E40>F40,\"! ? !\",\"OK\"))","v":"OK"},null,{"$f":"IF(AND(B40=\" -\",E40<>0),\"! ? !\",\"OK\")","v":"OK"}]
[null,{"$f":"IF('00'!B41=\"\",\" -\",'00'!B41)","v":" -"},null,null,null,{"$f":"IF('00'!F41=\"\",\"\",'00'!F41)","v":""},null,null,null,null,null,null,null,{"$f":"IF(B41=\"\",\"\",IF(E41>F41,\"! ? !\",\"OK\"))","v":"OK"},null,{"$f":"IF(AND(B41=\" -\",E41<>0),\"! ? !\",\"OK\")","v":"OK"}]
[null,{"$f":"IF('00'!B42=\"\",\" -\",'00'!B42)","v":" -"}]
[null,{"$f":"IF('00'!B43=\"\",\" -\",'00'!B43)","v":"Aptitude naturelle / Natural ability "},null,{"$f":"IF('00'!D43=\"\",\"\",'00'!D43)","v":10},null,{"$f":"IF('00'!F43=\"\",\"\",'00'!F43)","v":3},{"$f":"SUM(F43:F47)","v":10},null,null,null,null,null,null,{"$f":"IF(B43=\"\",\"\",IF(E43>F43,\"! ? !\",\"OK\"))","v":"OK"},null,{"$f":"IF(AND(B43=\" -\",E43<>0),\"! ? !\",\"OK\")","v":"OK"}]
[null,{"$f":"IF('00'!B44=\"\",\" -\",'00'!B44)","v":"Absence d’agressivité/ gentleness "},null,null,null,{"$f":"IF('00'!F44=\"\",\"\",'00'!F44)","v":2},null,null,null,null,null,null,null,"OK",null,"OK"]
[null,{"$f":"IF('00'!B45=\"\",\" -\",'00'!B45)","v":"Intelligence d’exécution/ Intelligence of execution  "},null,null,null,{"$f":"IF('00'!F45=\"\",\"\",'00'!F45)","v":2},null,null,null,null,null,null,null,"OK",null,"OK"]
[null,{"$f":"IF('00'!B46=\"\",\" -\",'00'!B46)","v":"Obéissance / Obedience "},null,null,null,{"$f":"IF('00'!F46=\"\",\"\",'00'!F46)","v":3},null,null,null,null,null,null,null,"OK",null,"OK"]
[null,{"$f":"IF('00'!B47=\"\",\" -\",'00'!B47)","v":" -"},null,null,null,{"$f":"IF('00'!F47=\"\",\"\",'00'!F47)","v":""},null,null,null,null,null,null,null,"OK",null,"OK"]
[null,{"$f":"IF('00'!B48=\"\",\" -\",'00'!B48)","v":" -"},null,{"$f":"IF('00'!D48=\"\",\"\",'00'!D48)","v":""},null,{"$f":"IF('00'!F48=\"\",\"\",'00'!F48)","v":""},{"$f":"SUM(F48:F50)","v":0},null,null,null,null,null,null,"OK",null,"OK"]
[null,{"$f":"IF('00'!B49=\"\",\" -\",'00'!B49)","v":" -"},null,null,null,{"$f":"IF('00'!F49=\"\",\"\",'00'!F49)","v":""},null,null,null,null,null,null,null,"OK",null,"OK"," "]
[null,{"$f":"IF('00'!B50=\"\",\" -\",'00'!B50)","v":" -"},null,null,null,{"$f":"IF('00'!F50=\"\",\"\",'00'!F50)","v":""},null,null,null,null,null,null,null,"OK",null,"OK"]
[null,"Pointage du Travail  ==>  ",null,null,{"$f":"SUM(E17:E50)","v":0},{"$f":"SUM(F17:F50)","v":100},null,null,"Temps = "]
[null,"Pénalités Générales :\n(chiffre négatif)    .",null,null,null,null,null,"Informations sur les pénalités générales :\n   \n   \n   ",null,null,"Classement :",null,null,{"$f":"IF(E52=\"\",\"\",IF(E52>0,\"ATTENTION : 'Pénalité Générales' doit être un nombre négatif ! \",\"OK\"))","v":""}]
[null,"TOTAL GENERAL =",null,null,{"$f":"IF(COUNT(E17:E50)=0,\"-\",E51+E52)","v":"-"},null,null,"Qualificatif :",{"$f":"IF(E53=\"-\",\"-\",IF(E53>89.9999,\"EXCELLENT\",IF(E53>79.9999,\"TRES BON\",IF(E53>69.999,\"BON\",IF(E53>59.999,\"Satisfaisant\",IF(E53>0.1,\"insuffisant \",\"éliminé \"))))))","v":"-"},null,{"$f":"Fiche_organisateur_N°2!P33","v":"X"},{"$f":"'Rapport de Concours'!D40","v":0}]
[null,"CACITR / RCACITR / CACTR / RCACTR :",null,null," -",null,null," <== sur décision du juge "]
[null,"Observations :  ",null,null,null,null,null,null,null,null,null,null,{"$f":"M51+M52","v":0}]
[]
[null,null,null,null,null,null,null,null,"Le Juge :",{"$f":"Fiche_organisateur_N°1!E28","v":0}]

{"sheet":"18","index":25,"n_rows":57,"n_cols":18,"rows_kept":57,"cut":false,"hidden":false,"merged":[[10,8,10,9],[0,10,0,11],[2,1,2,11],[8,8,8,9],[9,8,9,9],[3,2,3,9],[11,8,11,9],[14,4,14,5],[14,7,14,11],[15,1,15,11],[16,1,16,2],[16,3,21,3],[16,6,21,6],[16,7,16,11],[17,1,17,2],[17,7,17,11],[18,1,18,2],[18,7,18,11],[19,1,19,2],[19,7,19,11],[20,1,20,2],[20,7,20,11],[28,1,28,11],[21,1,21,2],[21,7,21,11],[22,1,22,11],[23,1,23,2],[23,3,27,3],[23,6,27,6],[23,7,23,11],[24,1,24,2],[24,7,24,11],[25,1,25,2],[25,7,25,11],[26,1,26,2],[26,7,26,11],[27,1,27,2],[27,7,27,11],[29,1,29,2],[29,3,35,3],[29,6,35,6],[29,7,29,11],[30,1,30,2],[30,7,30,11],[31,1,31,2],[31,7,31,11],[32,1,32,2],[32,7,32,11],[33,1,33,2],[33,7,33,11],[34,1,34,2],[34,7,34,11],[35,1,35,2],[35,7,35,11],[36,1,36,11],[37,1,37,2],[37,3,40,3],[37,6,40,6],[37,7,37,11],[38,1,38,2],[38,7,38,11],[39,1,39,2],[39,7,39,11],[40,1,40,2],[40,7,40,11],[41,1,41,11],[42,1,42,2],[42,3,46,3],[42,6,46,6],[42,7,42,11],[43,1,43,2],[43,7,43,11],[44,1,44,2],[44,7,44,11],[45,1,45,2],[45,7,45,11],[46,1,46,2],[46,7,46,11],[47,1,47,2],[47,3,49,3],[47,6,49,6],[47,7,47,11],[48,1,48,2],[48,7,48,11],[49,1,49,2],[49,7,49,11],[50,1,50,3],[50,9,50,11],[51,1,51,3],[51,7,51,9],[51,10,51,11],[54,1,54,11],[56,9,56,11],[52,1,52,3],[52,4,52,5],[52,8,52,9],[53,1,53,3],[53,4,53,5],[53,7,53,9]]}
[null,null,null,null,null,null,null,null,null,null,{"$f":"Fiche_organisateur_N°1!$E$26","v":"IHT 1"}]
[]
[null,"COMMISSION D'UTILISATION TROUPEAUX"]
[null,null,"Epreuve de travail sur Ovins - TRADITIONAL STYLE "]
[null,"ORGANISATEUR :",{"$f":"Fiche_organisateur_N°1!E15","v":0}]
[null,"Lieu :",{"$f":"Fiche_organisateur_N°1!E16","v":0},null,null,null,null,"Date :",{"$f":"Fiche_organisateur_N°1!$E$13","v":0}]
[null,"Contact :",{"$f":"Fiche_organisateur_N°1!E18","v":0}]
[]
[null,"PROPRIETAIRE :",{"$f":"Fiche_organisateur_N°2!C34","v":0},null,null,null,null,"Race et sexe",{"$f":"Fiche_organisateur_N°2!G34","v":0}]
[null,"CONDUCTEUR :",{"$f":"Fiche_organisateur_N°2!D34","v":0},null,null,null,null,"N° FAPAC :",{"$f":"Fiche_organisateur_N°2!K34","v":0}]
[null,"NOM DU CHIEN :",{"$f":"Fiche_organisateur_N°2!E34","v":0},null,null,null,null,"AFFIXE :",{"$f":"Fiche_organisateur_N°2!F34","v":0}]
[null,null,null,null,null,null,null,"N° d'Identification",{"$f":"Fiche_organisateur_N°2!L34","v":0},null,null,null,null,"Contrôle de saisie (sur les onglets 01 à 20 )"]
[]
[null,null,null,null,null,null,null,null,null,null,null,null,null,"Ces colonnes n'apparaissent pas lors de l'impression…"]
[null,"Epreuves                ",null,null,"Pointages /100",null,null,{"$f":"IF(OR('00'!N51<>30,LEFT('00'!H51,9)=\"ATTENTION\")=1,\"NON VALIDE => corriger la feuille 00 ! ! !\",\"Observations\")","v":"Observations"},null,null,null,null,null,"contrôle-1",null,"contrôle-2"]
[null,{"$f":"IF('00'!B16=\"\",\" -\",'00'!B16)","v":" -"}]
[null,{"$f":"IF('00'!B17=\"\",\" -\",'00'!B17)","v":"Sortie de parc ou bergerie / Exit from the pen "},null,{"$f":"IF('00'!D17=\"\",\"\",'00'!D17)","v":20},null,{"$f":"IF('00'!F17=\"\",\"\",'00'!F17)","v":15},{"$f":"SUM(F17:F22)","v":20},null,null,null,null,null,null,{"$f":"IF(B17=\"\",\"\",IF(E17>F17,\"! ? !\",\"OK\"))","v":"OK"},null,{"$f":"IF(AND(B17=\" -\",E17<>0),\"! ? !\",\"OK\")","v":"OK"}]
[null,{"$f":"IF('00'!B18=\"\",\" -\",'00'!B18)","v":" -"},null,null,null,{"$f":"IF('00'!F18=\"\",\"\",'00'!F18)","v":""},null,null,null,null,null,null,null,"OK",null,"OK",null,"Contrôle-1 : Contrôle que les valeurs entrées ne sont pas supérieures"]
[null,{"$f":"IF('00'!B19=\"\",\" -\",'00'!B19)","v":" -"},null,null,null,{"$f":"IF('00'!F19=\"\",\"\",'00'!F19)","v":""},null,null,null,null,null,null,null,"OK",null,"OK",null,"                    aux pointages maxi attribués à chaque épreuve…"]
[null,{"$f":"IF('00'!B20=\"\",\" -\",'00'!B20)","v":" -"},null,null,null,{"$f":"IF('00'!F20=\"\",\"\",'00'!F20)","v":""},null,null,null,null,null,null,null,"OK",null,"OK"]
[null,{"$f":"IF('00'!B21=\"\",\" -\",'00'!B21)","v":" -"},null,null,null,{"$f":"IF('00'!F21=\"\",\"\",'00'!F21)","v":""},null,null,null,null,null,null,null,"OK",null,"OK"]
[null,{"$f":"IF('00'!B22=\"\",\" -\",'00'!B22)","v":"Rentrée du troupeau  / Re-pen"},null,null,null,{"$f":"IF('00'!F22=\"\",\"\",'00'!F22)","v":5},null,null,null,null,null,null,null,"OK",null,"OK"]
[null,{"$f":"IF('00'!B23=\"\",\" -\",'00'!B23)","v":" -"}]
[null,{"$f":"IF('00'!B24=\"\",\" -\",'00'!B24)","v":"Pont/ Bridge"},null,{"$f":"IF('00'!D24=\"\",\"\",'00'!D24)","v":15},null,{"$f":"IF('00'!F24=\"\",\"\",'00'!F24)","v":5},{"$f":"SUM(F24:F28)","v":15},null,null,null,null,null,null,{"$f":"IF(B24=\"\",\"\",IF(E24>F24,\"! ? !\",\"OK\"))","v":"OK"},null,{"$f":"IF(AND(B24=\" -\",E24<>0),\"! ? !\",\"OK\")","v":"OK"}]
[null,{"$f":"IF('00'!B25=\"\",\" -\",'00'!B25)","v":"obstacle A"},null,null,null,{"$f":"IF('00'!F25=\"\",\"\",'00'!F25)","v":10},null,null,null,null,null,null,null,{"$f":"IF(B25=\"\",\"\",IF(E25>F25,\"! ? !\",\"OK\"))","v":"OK"},null,{"$f":"IF(AND(B25=\" -\",E25<>0),\"! ? !\",\"OK\")","v":"OK"}]
[null,{"$f":"IF('00'!B26=\"\",\" -\",'00'!B26)","v":"Qbstacle B"},null,null,null,{"$f":"IF('00'!F26=\"\",\"\",'00'!F26)","v":""},null,null,null,null,null,null,null,{"$f":"IF(B26=\"\",\"\",IF(E26>F26,\"! ? !\",\"OK\"))","v":"OK"},null,{"$f":"IF(AND(B26=\" -\",E26<>0),\"! ? !\",\"OK\")","v":"OK"}]
[null,{"$f":"IF('00'!B27=\"\",\" -\",'00'!B27)","v":"Obstacle C"},null,null,null,{"$f":"IF('00'!F27=\"\",\"\",'00'!F27)","v":""},null,null,null,null,null,null,null,{"$f":"IF(B27=\"\",\"\",IF(E27>F27,\"! ? !\",\"OK\"))","v":"OK"},null,{"$f":"IF(AND(B27=\" -\",E27<>0),\"! ? !\",\"OK\")","v":"OK"}]
[null,{"$f":"IF('00'!B28=\"\",\" -\",'00'!B28)","v":" -"},null,null,null,{"$f":"IF('00'!F28=\"\",\"\",'00'!F28)","v":""},null,null,null,null,null,null,null,{"$f":"IF(B28=\"\",\"\",IF(E28>F28,\"! ? !\",\"OK\"))","v":"OK"},null,{"$f":"IF(AND(B28=\" -\",E28<>0),\"! ? !\",\"OK\")","v":"OK"}]
[null,{"$f":"IF('00'!B29=\"\",\" -\",'00'!B29)","v":" -"}]
[null,{"$f":"IF('00'!B30=\"\",\" -\",'00'!B30)","v":"Conduite /Moving"},null,{"$f":"IF('00'!D30=\"\",\"\",'00'!D30)","v":45},null,{"$f":"IF('00'!F30=\"\",\"\",'00'!F30)","v":20},{"$f":"SUM(F30:F36)","v":45},null,null,null,null,null,null,{"$f":"IF(B30=\"\",\"\",IF(E30>F30,\"! ? !\",\"OK\"))","v":"OK"},null,{"$f":"IF(AND(B30=\" -\",E30<>0),\"! ? !\",\"OK\")","v":"OK"},null,"Contrôle-2 : Contrôle que les lignes sans épreuve ne contiennent pas de note"]
[null,{"$f":"IF('00'!B31=\"\",\" -\",'00'!B31)","v":"Pâturage / Grazing"},null,null,null,{"$f":"IF('00'!F31=\"\",\"\",'00'!F31)","v":20},null,null,null,null,null,null,null,"OK",null,"OK"]
[null,{"$f":"IF('00'!B32=\"\",\" -\",'00'!B32)","v":"Prise de brebis/ catching sheep and holding a sheep "},null,null,null,{"$f":"IF('00'!F32=\"\",\"\",'00'!F32)","v":5},null,null,null,null,null,null,null,"OK",null,"OK"]
[null,{"$f":"IF('00'!B33=\"\",\" -\",'00'!B33)","v":"Protection de cultures/ Crop protection "},null,null,null,{"$f":"IF('00'!F33=\"\",\"\",'00'!F33)","v":""},null,null,null,null,null,null,null,"OK",null,"OK"]
[null,{"$f":"IF('00'!B34=\"\",\" -\",'00'!B34)","v":"Traffic/ Vehicule "},null,null,null,{"$f":"IF('00'!F34=\"\",\"\",'00'!F34)","v":""},null,null,null,null,null,null,null,"OK",null,"OK"]
[null,{"$f":"IF('00'!B35=\"\",\" -\",'00'!B35)","v":" -"},null,null,null,{"$f":"IF('00'!F35=\"\",\"\",'00'!F35)","v":""},null,null,null,null,null,null,null,"OK",null,"OK"]
[null,{"$f":"IF('00'!B36=\"\",\" -\",'00'!B36)","v":" -"},null,null,null,{"$f":"IF('00'!F36=\"\",\"\",'00'!F36)","v":""},null,null,null,null,null,null,null,"OK",null,"OK"]
[null,{"$f":"IF('00'!B37=\"\",\" -\",'00'!B37)","v":" -"}]
[null,{"$f":"IF('00'!B38=\"\",\" -\",'00'!B38)","v":"Arrêt du troupeau / Stop 1"},null,{"$f":"IF('00'!D38=\"\",\"\",'00'!D38)","v":10},null,{"$f":"IF('00'!F38=\"\",\"\",'00'!F38)","v":10},{"$f":"SUM(F38:F41)","v":10},null,null,null,null,null,null,{"$f":"IF(B38=\"\",\"\",IF(E38>F38,\"! ? !\",\"OK\"))","v":"OK"},null,{"$f":"IF(AND(B38=\" -\",E38<>0),\"! ? !\",\"OK\")","v":"OK"}]
[null,{"$f":"IF('00'!B39=\"\",\" -\",'00'!B39)","v":"Arrêt du troupeau / Stop 2"},null,null,null,{"$f":"IF('00'!F39=\"\",\"\",'00'!F39)","v":""},null,null,null,null,null,null,null,{"$f":"IF(B39=\"\",\"\",IF(E39>F39,\"! ? !\",\"OK\"))","v":"OK"},null,{"$f":"IF(AND(B39=\" -\",E39<>0),\"! ? !\",\"OK\")","v":"OK"}]
[null,{"$f":"IF('00'!B40=\"\",\" -\",'00'!B40)","v":"Arrêt du troupeau / Stop 3"},null,null,null,{"$f":"IF('00'!F40=\"\",\"\",'00'!F40)","v":""},null,null,null,null,null,null,null,{"$f":"IF(B40=\"\",\"\",IF(E40>F40,\"! ? !\",\"OK\"))","v":"OK"},null,{"$f":"IF(AND(B40=\" -\",E40<>0),\"! ? !\",\"OK\")","v":"OK"}]
[null,{"$f":"IF('00'!B41=\"\",\" -\",'00'!B41)","v":" -"},null,null,null,{"$f":"IF('00'!F41=\"\",\"\",'00'!F41)","v":""},null,null,null,null,null,null,null,{"$f":"IF(B41=\"\",\"\",IF(E41>F41,\"! ? !\",\"OK\"))","v":"OK"},null,{"$f":"IF(AND(B41=\" -\",E41<>0),\"! ? !\",\"OK\")","v":"OK"}]
[null,{"$f":"IF('00'!B42=\"\",\" -\",'00'!B42)","v":" -"}]
[null,{"$f":"IF('00'!B43=\"\",\" -\",'00'!B43)","v":"Aptitude naturelle / Natural ability "},null,{"$f":"IF('00'!D43=\"\",\"\",'00'!D43)","v":10},null,{"$f":"IF('00'!F43=\"\",\"\",'00'!F43)","v":3},{"$f":"SUM(F43:F47)","v":10},null,null,null,null,null,null,{"$f":"IF(B43=\"\",\"\",IF(E43>F43,\"! ? !\",\"OK\"))","v":"OK"},null,{"$f":"IF(AND(B43=\" -\",E43<>0),\"! ? !\",\"OK\")","v":"OK"}]
[null,{"$f":"IF('00'!B44=\"\",\" -\",'00'!B44)","v":"Absence d’agressivité/ gentleness "},null,null,null,{"$f":"IF('00'!F44=\"\",\"\",'00'!F44)","v":2},null,null,null,null,null,null,null,"OK",null,"OK"]
[null,{"$f":"IF('00'!B45=\"\",\" -\",'00'!B45)","v":"Intelligence d’exécution/ Intelligence of execution  "},null,null,null,{"$f":"IF('00'!F45=\"\",\"\",'00'!F45)","v":2},null,null,null,null,null,null,null,"OK",null,"OK"]
[null,{"$f":"IF('00'!B46=\"\",\" -\",'00'!B46)","v":"Obéissance / Obedience "},null,null,null,{"$f":"IF('00'!F46=\"\",\"\",'00'!F46)","v":3},null,null,null,null,null,null,null,"OK",null,"OK"]
[null,{"$f":"IF('00'!B47=\"\",\" -\",'00'!B47)","v":" -"},null,null,null,{"$f":"IF('00'!F47=\"\",\"\",'00'!F47)","v":""},null,null,null,null,null,null,null,"OK",null,"OK"]
[null,{"$f":"IF('00'!B48=\"\",\" -\",'00'!B48)","v":" -"},null,{"$f":"IF('00'!D48=\"\",\"\",'00'!D48)","v":""},null,{"$f":"IF('00'!F48=\"\",\"\",'00'!F48)","v":""},{"$f":"SUM(F48:F50)","v":0},null,null,null,null,null,null,"OK",null,"OK"]
[null,{"$f":"IF('00'!B49=\"\",\" -\",'00'!B49)","v":" -"},null,null,null,{"$f":"IF('00'!F49=\"\",\"\",'00'!F49)","v":""},null,null,null,null,null,null,null,"OK",null,"OK"," "]
[null,{"$f":"IF('00'!B50=\"\",\" -\",'00'!B50)","v":" -"},null,null,null,{"$f":"IF('00'!F50=\"\",\"\",'00'!F50)","v":""},null,null,null,null,null,null,null,"OK",null,"OK"]
[null,"Pointage du Travail  ==>  ",null,null,{"$f":"SUM(E17:E50)","v":0},{"$f":"SUM(F17:F50)","v":100},null,null,"Temps = "]
[null,"Pénalités Générales :\n(chiffre négatif)    .",null,null,null,null,null,"Informations sur les pénalités générales :\n   \n   \n   ",null,null,"Classement :",null,null,{"$f":"IF(E52=\"\",\"\",IF(E52>0,\"ATTENTION : 'Pénalité Générales' doit être un nombre négatif ! \",\"OK\"))","v":""}]
[null,"TOTAL GENERAL =",null,null,{"$f":"IF(COUNT(E17:E50)=0,\"-\",E51+E52)","v":"-"},null,null,"Qualificatif :",{"$f":"IF(E53=\"-\",\"-\",IF(E53>89.9999,\"EXCELLENT\",IF(E53>79.9999,\"TRES BON\",IF(E53>69.999,\"BON\",IF(E53>59.999,\"Satisfaisant\",IF(E53>0.1,\"insuffisant \",\"éliminé \"))))))","v":"-"},null,{"$f":"Fiche_organisateur_N°2!P34","v":"X"},{"$f":"'Rapport de Concours'!D40","v":0}]
[null,"CACITR / RCACITR / CACTR / RCACTR :",null,null," -",null,null," <== sur décision du juge "]
[null,"Observations :  ",null,null,null,null,null,null,null,null,null,null,{"$f":"M51+M52","v":0}]
[]
[null,null,null,null,null,null,null,null,"Le Juge :",{"$f":"Fiche_organisateur_N°1!E28","v":0}]

{"sheet":"19","index":26,"n_rows":57,"n_cols":18,"rows_kept":57,"cut":false,"hidden":false,"merged":[[10,8,10,9],[0,10,0,11],[2,1,2,11],[8,8,8,9],[9,8,9,9],[3,2,3,9],[11,8,11,9],[14,4,14,5],[14,7,14,11],[15,1,15,11],[16,1,16,2],[16,3,21,3],[16,6,21,6],[16,7,16,11],[17,1,17,2],[17,7,17,11],[18,1,18,2],[18,7,18,11],[19,1,19,2],[19,7,19,11],[20,1,20,2],[20,7,20,11],[28,1,28,11],[21,1,21,2],[21,7,21,11],[22,1,22,11],[23,1,23,2],[23,3,27,3],[23,6,27,6],[23,7,23,11],[24,1,24,2],[24,7,24,11],[25,1,25,2],[25,7,25,11],[26,1,26,2],[26,7,26,11],[27,1,27,2],[27,7,27,11],[29,1,29,2],[29,3,35,3],[29,6,35,6],[29,7,29,11],[30,1,30,2],[30,7,30,11],[31,1,31,2],[31,7,31,11],[32,1,32,2],[32,7,32,11],[33,1,33,2],[33,7,33,11],[34,1,34,2],[34,7,34,11],[35,1,35,2],[35,7,35,11],[36,1,36,11],[37,1,37,2],[37,3,40,3],[37,6,40,6],[37,7,37,11],[38,1,38,2],[38,7,38,11],[39,1,39,2],[39,7,39,11],[40,1,40,2],[40,7,40,11],[41,1,41,11],[42,1,42,2],[42,3,46,3],[42,6,46,6],[42,7,42,11],[43,1,43,2],[43,7,43,11],[44,1,44,2],[44,7,44,11],[45,1,45,2],[45,7,45,11],[46,1,46,2],[46,7,46,11],[47,1,47,2],[47,3,49,3],[47,6,49,6],[47,7,47,11],[48,1,48,2],[48,7,48,11],[49,1,49,2],[49,7,49,11],[50,1,50,3],[50,9,50,11],[51,1,51,3],[51,7,51,9],[51,10,51,11],[54,1,54,11],[56,9,56,11],[52,1,52,3],[52,4,52,5],[52,8,52,9],[53,1,53,3],[53,4,53,5],[53,7,53,9]]}
[null,null,null,null,null,null,null,null,null,null,{"$f":"Fiche_organisateur_N°1!$E$26","v":"IHT 1"}]
[]
[null,"COMMISSION D'UTILISATION TROUPEAUX"]
[null,null,"Epreuve de travail sur Ovins - TRADITIONAL STYLE "]
[null,"ORGANISATEUR :",{"$f":"Fiche_organisateur_N°1!E15","v":0}]
[null,"Lieu :",{"$f":"Fiche_organisateur_N°1!E16","v":0},null,null,null,null,"Date :",{"$f":"Fiche_organisateur_N°1!$E$13","v":0}]
[null,"Contact :",{"$f":"Fiche_organisateur_N°1!E18","v":0}]
[]
[null,"PROPRIETAIRE :",{"$f":"Fiche_organisateur_N°2!C35","v":0},null,null,null,null,"Race et sexe",{"$f":"Fiche_organisateur_N°2!G35","v":0}]
[null,"CONDUCTEUR :",{"$f":"Fiche_organisateur_N°2!D35","v":0},null,null,null,null,"N° FAPAC :",{"$f":"Fiche_organisateur_N°2!K35","v":0}]
[null,"NOM DU CHIEN :",{"$f":"Fiche_organisateur_N°2!E35","v":0},null,null,null,null,"AFFIXE :",{"$f":"Fiche_organisateur_N°2!F35","v":0}]
[null,null,null,null,null,null,null,"N° d'Identification",{"$f":"Fiche_organisateur_N°2!L35","v":0},null,null,null,null,"Contrôle de saisie (sur les onglets 01 à 20 )"]
[]
[null,null,null,null,null,null,null,null,null,null,null,null,null,"Ces colonnes n'apparaissent pas lors de l'impression…"]
[null,"Epreuves                ",null,null,"Pointages /100",null,null,{"$f":"IF(OR('00'!N51<>30,LEFT('00'!H51,9)=\"ATTENTION\")=1,\"NON VALIDE => corriger la feuille 00 ! ! !\",\"Observations\")","v":"Observations"},null,null,null,null,null,"contrôle-1",null,"contrôle-2"]
[null,{"$f":"IF('00'!B16=\"\",\" -\",'00'!B16)","v":" -"}]
[null,{"$f":"IF('00'!B17=\"\",\" -\",'00'!B17)","v":"Sortie de parc ou bergerie / Exit from the pen "},null,{"$f":"IF('00'!D17=\"\",\"\",'00'!D17)","v":20},null,{"$f":"IF('00'!F17=\"\",\"\",'00'!F17)","v":15},{"$f":"SUM(F17:F22)","v":20},null,null,null,null,null,null,{"$f":"IF(B17=\"\",\"\",IF(E17>F17,\"! ? !\",\"OK\"))","v":"OK"},null,{"$f":"IF(AND(B17=\" -\",E17<>0),\"! ? !\",\"OK\")","v":"OK"}]
[null,{"$f":"IF('00'!B18=\"\",\" -\",'00'!B18)","v":" -"},null,null,null,{"$f":"IF('00'!F18=\"\",\"\",'00'!F18)","v":""},null,null,null,null,null,null,null,"OK",null,"OK",null,"Contrôle-1 : Contrôle que les valeurs entrées ne sont pas supérieures"]
[null,{"$f":"IF('00'!B19=\"\",\" -\",'00'!B19)","v":" -"},null,null,null,{"$f":"IF('00'!F19=\"\",\"\",'00'!F19)","v":""},null,null,null,null,null,null,null,"OK",null,"OK",null,"                    aux pointages maxi attribués à chaque épreuve…"]
[null,{"$f":"IF('00'!B20=\"\",\" -\",'00'!B20)","v":" -"},null,null,null,{"$f":"IF('00'!F20=\"\",\"\",'00'!F20)","v":""},null,null,null,null,null,null,null,"OK",null,"OK"]
[null,{"$f":"IF('00'!B21=\"\",\" -\",'00'!B21)","v":" -"},null,null,null,{"$f":"IF('00'!F21=\"\",\"\",'00'!F21)","v":""},null,null,null,null,null,null,null,"OK",null,"OK"]
[null,{"$f":"IF('00'!B22=\"\",\" -\",'00'!B22)","v":"Rentrée du troupeau  / Re-pen"},null,null,null,{"$f":"IF('00'!F22=\"\",\"\",'00'!F22)","v":5},null,null,null,null,null,null,null,"OK",null,"OK"]
[null,{"$f":"IF('00'!B23=\"\",\" -\",'00'!B23)","v":" -"}]
[null,{"$f":"IF('00'!B24=\"\",\" -\",'00'!B24)","v":"Pont/ Bridge"},null,{"$f":"IF('00'!D24=\"\",\"\",'00'!D24)","v":15},null,{"$f":"IF('00'!F24=\"\",\"\",'00'!F24)","v":5},{"$f":"SUM(F24:F28)","v":15},null,null,null,null,null,null,{"$f":"IF(B24=\"\",\"\",IF(E24>F24,\"! ? !\",\"OK\"))","v":"OK"},null,{"$f":"IF(AND(B24=\" -\",E24<>0),\"! ? !\",\"OK\")","v":"OK"}]
[null,{"$f":"IF('00'!B25=\"\",\" -\",'00'!B25)","v":"obstacle A"},null,null,null,{"$f":"IF('00'!F25=\"\",\"\",'00'!F25)","v":10},null,null,null,null,null,null,null,{"$f":"IF(B25=\"\",\"\",IF(E25>F25,\"! ? !\",\"OK\"))","v":"OK"},null,{"$f":"IF(AND(B25=\" -\",E25<>0),\"! ? !\",\"OK\")","v":"OK"}]
[null,{"$f":"IF('00'!B26=\"\",\" -\",'00'!B26)","v":"Qbstacle B"},null,null,null,{"$f":"IF('00'!F26=\"\",\"\",'00'!F26)","v":""},null,null,null,null,null,null,null,{"$f":"IF(B26=\"\",\"\",IF(E26>F26,\"! ? !\",\"OK\"))","v":"OK"},null,{"$f":"IF(AND(B26=\" -\",E26<>0),\"! ? !\",\"OK\")","v":"OK"}]
[null,{"$f":"IF('00'!B27=\"\",\" -\",'00'!B27)","v":"Obstacle C"},null,null,null,{"$f":"IF('00'!F27=\"\",\"\",'00'!F27)","v":""},null,null,null,null,null,null,null,{"$f":"IF(B27=\"\",\"\",IF(E27>F27,\"! ? !\",\"OK\"))","v":"OK"},null,{"$f":"IF(AND(B27=\" -\",E27<>0),\"! ? !\",\"OK\")","v":"OK"}]
[null,{"$f":"IF('00'!B28=\"\",\" -\",'00'!B28)","v":" -"},null,null,null,{"$f":"IF('00'!F28=\"\",\"\",'00'!F28)","v":""},null,null,null,null,null,null,null,{"$f":"IF(B28=\"\",\"\",IF(E28>F28,\"! ? !\",\"OK\"))","v":"OK"},null,{"$f":"IF(AND(B28=\" -\",E28<>0),\"! ? !\",\"OK\")","v":"OK"}]
[null,{"$f":"IF('00'!B29=\"\",\" -\",'00'!B29)","v":" -"}]
[null,{"$f":"IF('00'!B30=\"\",\" -\",'00'!B30)","v":"Conduite /Moving"},null,{"$f":"IF('00'!D30=\"\",\"\",'00'!D30)","v":45},null,{"$f":"IF('00'!F30=\"\",\"\",'00'!F30)","v":20},{"$f":"SUM(F30:F36)","v":45},null,null,null,null,null,null,{"$f":"IF(B30=\"\",\"\",IF(E30>F30,\"! ? !\",\"OK\"))","v":"OK"},null,{"$f":"IF(AND(B30=\" -\",E30<>0),\"! ? !\",\"OK\")","v":"OK"},null,"Contrôle-2 : Contrôle que les lignes sans épreuve ne contiennent pas de note"]
[null,{"$f":"IF('00'!B31=\"\",\" -\",'00'!B31)","v":"Pâturage / Grazing"},null,null,null,{"$f":"IF('00'!F31=\"\",\"\",'00'!F31)","v":20},null,null,null,null,null,null,null,"OK",null,"OK"]
[null,{"$f":"IF('00'!B32=\"\",\" -\",'00'!B32)","v":"Prise de brebis/ catching sheep and holding a sheep "},null,null,null,{"$f":"IF('00'!F32=\"\",\"\",'00'!F32)","v":5},null,null,null,null,null,null,null,"OK",null,"OK"]
[null,{"$f":"IF('00'!B33=\"\",\" -\",'00'!B33)","v":"Protection de cultures/ Crop protection "},null,null,null,{"$f":"IF('00'!F33=\"\",\"\",'00'!F33)","v":""},null,null,null,null,null,null,null,"OK",null,"OK"]
[null,{"$f":"IF('00'!B34=\"\",\" -\",'00'!B34)","v":"Traffic/ Vehicule "},null,null,null,{"$f":"IF('00'!F34=\"\",\"\",'00'!F34)","v":""},null,null,null,null,null,null,null,"OK",null,"OK"]
[null,{"$f":"IF('00'!B35=\"\",\" -\",'00'!B35)","v":" -"},null,null,null,{"$f":"IF('00'!F35=\"\",\"\",'00'!F35)","v":""},null,null,null,null,null,null,null,"OK",null,"OK"]
[null,{"$f":"IF('00'!B36=\"\",\" -\",'00'!B36)","v":" -"},null,null,null,{"$f":"IF('00'!F36=\"\",\"\",'00'!F36)","v":""},null,null,null,null,null,null,null,"OK",null,"OK"]
[null,{"$f":"IF('00'!B37=\"\",\" -\",'00'!B37)","v":" -"}]
[null,{"$f":"IF('00'!B38=\"\",\" -\",'00'!B38)","v":"Arrêt du troupeau / Stop 1"},null,{"$f":"IF('00'!D38=\"\",\"\",'00'!D38)","v":10},null,{"$f":"IF('00'!F38=\"\",\"\",'00'!F38)","v":10},{"$f":"SUM(F38:F41)","v":10},null,null,null,null,null,null,{"$f":"IF(B38=\"\",\"\",IF(E38>F38,\"! ? !\",\"OK\"))","v":"OK"},null,{"$f":"IF(AND(B38=\" -\",E38<>0),\"! ? !\",\"OK\")","v":"OK"}]
[null,{"$f":"IF('00'!B39=\"\",\" -\",'00'!B39)","v":"Arrêt du troupeau / Stop 2"},null,null,null,{"$f":"IF('00'!F39=\"\",\"\",'00'!F39)","v":""},null,null,null,null,null,null,null,{"$f":"IF(B39=\"\",\"\",IF(E39>F39,\"! ? !\",\"OK\"))","v":"OK"},null,{"$f":"IF(AND(B39=\" -\",E39<>0),\"! ? !\",\"OK\")","v":"OK"}]
[null,{"$f":"IF('00'!B40=\"\",\" -\",'00'!B40)","v":"Arrêt du troupeau / Stop 3"},null,null,null,{"$f":"IF('00'!F40=\"\",\"\",'00'!F40)","v":""},null,null,null,null,null,null,null,{"$f":"IF(B40=\"\",\"\",IF(E40>F40,\"! ? !\",\"OK\"))","v":"OK"},null,{"$f":"IF(AND(B40=\" -\",E40<>0),\"! ? !\",\"OK\")","v":"OK"}]
[null,{"$f":"IF('00'!B41=\"\",\" -\",'00'!B41)","v":" -"},null,null,null,{"$f":"IF('00'!F41=\"\",\"\",'00'!F41)","v":""},null,null,null,null,null,null,null,{"$f":"IF(B41=\"\",\"\",IF(E41>F41,\"! ? !\",\"OK\"))","v":"OK"},null,{"$f":"IF(AND(B41=\" -\",E41<>0),\"! ? !\",\"OK\")","v":"OK"}]
[null,{"$f":"IF('00'!B42=\"\",\" -\",'00'!B42)","v":" -"}]
[null,{"$f":"IF('00'!B43=\"\",\" -\",'00'!B43)","v":"Aptitude naturelle / Natural ability "},null,{"$f":"IF('00'!D43=\"\",\"\",'00'!D43)","v":10},null,{"$f":"IF('00'!F43=\"\",\"\",'00'!F43)","v":3},{"$f":"SUM(F43:F47)","v":10},null,null,null,null,null,null,{"$f":"IF(B43=\"\",\"\",IF(E43>F43,\"! ? !\",\"OK\"))","v":"OK"},null,{"$f":"IF(AND(B43=\" -\",E43<>0),\"! ? !\",\"OK\")","v":"OK"}]
[null,{"$f":"IF('00'!B44=\"\",\" -\",'00'!B44)","v":"Absence d’agressivité/ gentleness "},null,null,null,{"$f":"IF('00'!F44=\"\",\"\",'00'!F44)","v":2},null,null,null,null,null,null,null,"OK",null,"OK"]
[null,{"$f":"IF('00'!B45=\"\",\" -\",'00'!B45)","v":"Intelligence d’exécution/ Intelligence of execution  "},null,null,null,{"$f":"IF('00'!F45=\"\",\"\",'00'!F45)","v":2},null,null,null,null,null,null,null,"OK",null,"OK"]
[null,{"$f":"IF('00'!B46=\"\",\" -\",'00'!B46)","v":"Obéissance / Obedience "},null,null,null,{"$f":"IF('00'!F46=\"\",\"\",'00'!F46)","v":3},null,null,null,null,null,null,null,"OK",null,"OK"]
[null,{"$f":"IF('00'!B47=\"\",\" -\",'00'!B47)","v":" -"},null,null,null,{"$f":"IF('00'!F47=\"\",\"\",'00'!F47)","v":""},null,null,null,null,null,null,null,"OK",null,"OK"]
[null,{"$f":"IF('00'!B48=\"\",\" -\",'00'!B48)","v":" -"},null,{"$f":"IF('00'!D48=\"\",\"\",'00'!D48)","v":""},null,{"$f":"IF('00'!F48=\"\",\"\",'00'!F48)","v":""},{"$f":"SUM(F48:F50)","v":0},null,null,null,null,null,null,"OK",null,"OK"]
[null,{"$f":"IF('00'!B49=\"\",\" -\",'00'!B49)","v":" -"},null,null,null,{"$f":"IF('00'!F49=\"\",\"\",'00'!F49)","v":""},null,null,null,null,null,null,null,"OK",null,"OK"," "]
[null,{"$f":"IF('00'!B50=\"\",\" -\",'00'!B50)","v":" -"},null,null,null,{"$f":"IF('00'!F50=\"\",\"\",'00'!F50)","v":""},null,null,null,null,null,null,null,"OK",null,"OK"]
[null,"Pointage du Travail  ==>  ",null,null,{"$f":"SUM(E17:E50)","v":0},{"$f":"SUM(F17:F50)","v":100},null,null,"Temps = "]
[null,"Pénalités Générales :\n(chiffre négatif)    .",null,null,null,null,null,"Informations sur les pénalités générales :\n   \n   \n   ",null,null,"Classement :",null,null,{"$f":"IF(E52=\"\",\"\",IF(E52>0,\"ATTENTION : 'Pénalité Générales' doit être un nombre négatif ! \",\"OK\"))","v":""}]
[null,"TOTAL GENERAL =",null,null,{"$f":"IF(COUNT(E17:E50)=0,\"-\",E51+E52)","v":"-"},null,null,"Qualificatif :",{"$f":"IF(E53=\"-\",\"-\",IF(E53>89.9999,\"EXCELLENT\",IF(E53>79.9999,\"TRES BON\",IF(E53>69.999,\"BON\",IF(E53>59.999,\"Satisfaisant\",IF(E53>0.1,\"insuffisant \",\"éliminé \"))))))","v":"-"},null,{"$f":"Fiche_organisateur_N°2!P35","v":"X"},{"$f":"'Rapport de Concours'!D40","v":0}]
[null,"CACITR / RCACITR / CACTR / RCACTR :",null,null," -",null,null," <== sur décision du juge "]
[null,"Observations :  ",null,null,null,null,null,null,null,null,null,null,{"$f":"M51+M52","v":0}]
[]
[null,null,null,null,null,null,null,null,"Le Juge :",{"$f":"Fiche_organisateur_N°1!E28","v":0}]

{"sheet":"20","index":27,"n_rows":57,"n_cols":18,"rows_kept":57,"cut":false,"hidden":false,"merged":[[10,8,10,9],[0,10,0,11],[2,1,2,11],[8,8,8,9],[9,8,9,9],[3,2,3,9],[11,8,11,9],[14,4,14,5],[14,7,14,11],[15,1,15,11],[16,1,16,2],[16,3,21,3],[16,6,21,6],[16,7,16,11],[17,1,17,2],[17,7,17,11],[18,1,18,2],[18,7,18,11],[19,1,19,2],[19,7,19,11],[20,1,20,2],[20,7,20,11],[28,1,28,11],[21,1,21,2],[21,7,21,11],[22,1,22,11],[23,1,23,2],[23,3,27,3],[23,6,27,6],[23,7,23,11],[24,1,24,2],[24,7,24,11],[25,1,25,2],[25,7,25,11],[26,1,26,2],[26,7,26,11],[27,1,27,2],[27,7,27,11],[29,1,29,2],[29,3,35,3],[29,6,35,6],[29,7,29,11],[30,1,30,2],[30,7,30,11],[31,1,31,2],[31,7,31,11],[32,1,32,2],[32,7,32,11],[33,1,33,2],[33,7,33,11],[34,1,34,2],[34,7,34,11],[35,1,35,2],[35,7,35,11],[36,1,36,11],[37,1,37,2],[37,3,40,3],[37,6,40,6],[37,7,37,11],[38,1,38,2],[38,7,38,11],[39,1,39,2],[39,7,39,11],[40,1,40,2],[40,7,40,11],[41,1,41,11],[42,1,42,2],[42,3,46,3],[42,6,46,6],[42,7,42,11],[43,1,43,2],[43,7,43,11],[44,1,44,2],[44,7,44,11],[45,1,45,2],[45,7,45,11],[46,1,46,2],[46,7,46,11],[47,1,47,2],[47,3,49,3],[47,6,49,6],[47,7,47,11],[48,1,48,2],[48,7,48,11],[49,1,49,2],[49,7,49,11],[50,1,50,3],[50,9,50,11],[51,1,51,3],[51,7,51,9],[51,10,51,11],[54,1,54,11],[56,9,56,11],[52,1,52,3],[52,4,52,5],[52,8,52,9],[53,1,53,3],[53,4,53,5],[53,7,53,9]]}
[null,null,null,null,null,null,null,null,null,null,{"$f":"Fiche_organisateur_N°1!$E$26","v":"IHT 1"}]
[]
[null,"COMMISSION D'UTILISATION TROUPEAUX"]
[null,null,"Epreuve de travail sur Ovins - TRADITIONAL STYLE "]
[null,"ORGANISATEUR :",{"$f":"Fiche_organisateur_N°1!E15","v":0}]
[null,"Lieu :",{"$f":"Fiche_organisateur_N°1!E16","v":0},null,null,null,null,"Date :",{"$f":"Fiche_organisateur_N°1!$E$13","v":0}]
[null,"Contact :",{"$f":"Fiche_organisateur_N°1!E18","v":0}]
[]
[null,"PROPRIETAIRE :",{"$f":"Fiche_organisateur_N°2!C36","v":0},null,null,null,null,"Race et sexe",{"$f":"Fiche_organisateur_N°2!G36","v":0}]
[null,"CONDUCTEUR :",{"$f":"Fiche_organisateur_N°2!D36","v":0},null,null,null,null,"N° FAPAC :",{"$f":"Fiche_organisateur_N°2!K36","v":0}]
[null,"NOM DU CHIEN :",{"$f":"Fiche_organisateur_N°2!E36","v":0},null,null,null,null,"AFFIXE :",{"$f":"Fiche_organisateur_N°2!F36","v":0}]
[null,null,null,null,null,null,null,"N° d'Identification",{"$f":"Fiche_organisateur_N°2!L36","v":0},null,null,null,null,"Contrôle de saisie (sur les onglets 01 à 20 )"]
[]
[null,null,null,null,null,null,null,null,null,null,null,null,null,"Ces colonnes n'apparaissent pas lors de l'impression…"]
[null,"Epreuves                ",null,null,"Pointages /100",null,null,{"$f":"IF(OR('00'!N51<>30,LEFT('00'!H51,9)=\"ATTENTION\")=1,\"NON VALIDE => corriger la feuille 00 ! ! !\",\"Observations\")","v":"Observations"},null,null,null,null,null,"contrôle-1",null,"contrôle-2"]
[null,{"$f":"IF('00'!B16=\"\",\" -\",'00'!B16)","v":" -"}]
[null,{"$f":"IF('00'!B17=\"\",\" -\",'00'!B17)","v":"Sortie de parc ou bergerie / Exit from the pen "},null,{"$f":"IF('00'!D17=\"\",\"\",'00'!D17)","v":20},null,{"$f":"IF('00'!F17=\"\",\"\",'00'!F17)","v":15},{"$f":"SUM(F17:F22)","v":20},null,null,null,null,null,null,{"$f":"IF(B17=\"\",\"\",IF(E17>F17,\"! ? !\",\"OK\"))","v":"OK"},null,{"$f":"IF(AND(B17=\" -\",E17<>0),\"! ? !\",\"OK\")","v":"OK"}]
[null,{"$f":"IF('00'!B18=\"\",\" -\",'00'!B18)","v":" -"},null,null,null,{"$f":"IF('00'!F18=\"\",\"\",'00'!F18)","v":""},null,null,null,null,null,null,null,"OK",null,"OK",null,"Contrôle-1 : Contrôle que les valeurs entrées ne sont pas supérieures"]
[null,{"$f":"IF('00'!B19=\"\",\" -\",'00'!B19)","v":" -"},null,null,null,{"$f":"IF('00'!F19=\"\",\"\",'00'!F19)","v":""},null,null,null,null,null,null,null,"OK",null,"OK",null,"                    aux pointages maxi attribués à chaque épreuve…"]
[null,{"$f":"IF('00'!B20=\"\",\" -\",'00'!B20)","v":" -"},null,null,null,{"$f":"IF('00'!F20=\"\",\"\",'00'!F20)","v":""},null,null,null,null,null,null,null,"OK",null,"OK"]
[null,{"$f":"IF('00'!B21=\"\",\" -\",'00'!B21)","v":" -"},null,null,null,{"$f":"IF('00'!F21=\"\",\"\",'00'!F21)","v":""},null,null,null,null,null,null,null,"OK",null,"OK"]
[null,{"$f":"IF('00'!B22=\"\",\" -\",'00'!B22)","v":"Rentrée du troupeau  / Re-pen"},null,null,null,{"$f":"IF('00'!F22=\"\",\"\",'00'!F22)","v":5},null,null,null,null,null,null,null,"OK",null,"OK"]
[null,{"$f":"IF('00'!B23=\"\",\" -\",'00'!B23)","v":" -"}]
[null,{"$f":"IF('00'!B24=\"\",\" -\",'00'!B24)","v":"Pont/ Bridge"},null,{"$f":"IF('00'!D24=\"\",\"\",'00'!D24)","v":15},null,{"$f":"IF('00'!F24=\"\",\"\",'00'!F24)","v":5},{"$f":"SUM(F24:F28)","v":15},null,null,null,null,null,null,{"$f":"IF(B24=\"\",\"\",IF(E24>F24,\"! ? !\",\"OK\"))","v":"OK"},null,{"$f":"IF(AND(B24=\" -\",E24<>0),\"! ? !\",\"OK\")","v":"OK"}]
[null,{"$f":"IF('00'!B25=\"\",\" -\",'00'!B25)","v":"obstacle A"},null,null,null,{"$f":"IF('00'!F25=\"\",\"\",'00'!F25)","v":10},null,null,null,null,null,null,null,{"$f":"IF(B25=\"\",\"\",IF(E25>F25,\"! ? !\",\"OK\"))","v":"OK"},null,{"$f":"IF(AND(B25=\" -\",E25<>0),\"! ? !\",\"OK\")","v":"OK"}]
[null,{"$f":"IF('00'!B26=\"\",\" -\",'00'!B26)","v":"Qbstacle B"},null,null,null,{"$f":"IF('00'!F26=\"\",\"\",'00'!F26)","v":""},null,null,null,null,null,null,null,{"$f":"IF(B26=\"\",\"\",IF(E26>F26,\"! ? !\",\"OK\"))","v":"OK"},null,{"$f":"IF(AND(B26=\" -\",E26<>0),\"! ? !\",\"OK\")","v":"OK"}]
[null,{"$f":"IF('00'!B27=\"\",\" -\",'00'!B27)","v":"Obstacle C"},null,null,null,{"$f":"IF('00'!F27=\"\",\"\",'00'!F27)","v":""},null,null,null,null,null,null,null,{"$f":"IF(B27=\"\",\"\",IF(E27>F27,\"! ? !\",\"OK\"))","v":"OK"},null,{"$f":"IF(AND(B27=\" -\",E27<>0),\"! ? !\",\"OK\")","v":"OK"}]
[null,{"$f":"IF('00'!B28=\"\",\" -\",'00'!B28)","v":" -"},null,null,null,{"$f":"IF('00'!F28=\"\",\"\",'00'!F28)","v":""},null,null,null,null,null,null,null,{"$f":"IF(B28=\"\",\"\",IF(E28>F28,\"! ? !\",\"OK\"))","v":"OK"},null,{"$f":"IF(AND(B28=\" -\",E28<>0),\"! ? !\",\"OK\")","v":"OK"}]
[null,{"$f":"IF('00'!B29=\"\",\" -\",'00'!B29)","v":" -"}]
[null,{"$f":"IF('00'!B30=\"\",\" -\",'00'!B30)","v":"Conduite /Moving"},null,{"$f":"IF('00'!D30=\"\",\"\",'00'!D30)","v":45},null,{"$f":"IF('00'!F30=\"\",\"\",'00'!F30)","v":20},{"$f":"SUM(F30:F36)","v":45},null,null,null,null,null,null,{"$f":"IF(B30=\"\",\"\",IF(E30>F30,\"! ? !\",\"OK\"))","v":"OK"},null,{"$f":"IF(AND(B30=\" -\",E30<>0),\"! ? !\",\"OK\")","v":"OK"},null,"Contrôle-2 : Contrôle que les lignes sans épreuve ne contiennent pas de note"]
[null,{"$f":"IF('00'!B31=\"\",\" -\",'00'!B31)","v":"Pâturage / Grazing"},null,null,null,{"$f":"IF('00'!F31=\"\",\"\",'00'!F31)","v":20},null,null,null,null,null,null,null,"OK",null,"OK"]
[null,{"$f":"IF('00'!B32=\"\",\" -\",'00'!B32)","v":"Prise de brebis/ catching sheep and holding a sheep "},null,null,null,{"$f":"IF('00'!F32=\"\",\"\",'00'!F32)","v":5},null,null,null,null,null,null,null,"OK",null,"OK"]
[null,{"$f":"IF('00'!B33=\"\",\" -\",'00'!B33)","v":"Protection de cultures/ Crop protection "},null,null,null,{"$f":"IF('00'!F33=\"\",\"\",'00'!F33)","v":""},null,null,null,null,null,null,null,"OK",null,"OK"]
[null,{"$f":"IF('00'!B34=\"\",\" -\",'00'!B34)","v":"Traffic/ Vehicule "},null,null,null,{"$f":"IF('00'!F34=\"\",\"\",'00'!F34)","v":""},null,null,null,null,null,null,null,"OK",null,"OK"]
[null,{"$f":"IF('00'!B35=\"\",\" -\",'00'!B35)","v":" -"},null,null,null,{"$f":"IF('00'!F35=\"\",\"\",'00'!F35)","v":""},null,null,null,null,null,null,null,"OK",null,"OK"]
[null,{"$f":"IF('00'!B36=\"\",\" -\",'00'!B36)","v":" -"},null,null,null,{"$f":"IF('00'!F36=\"\",\"\",'00'!F36)","v":""},null,null,null,null,null,null,null,"OK",null,"OK"]
[null,{"$f":"IF('00'!B37=\"\",\" -\",'00'!B37)","v":" -"}]
[null,{"$f":"IF('00'!B38=\"\",\" -\",'00'!B38)","v":"Arrêt du troupeau / Stop 1"},null,{"$f":"IF('00'!D38=\"\",\"\",'00'!D38)","v":10},null,{"$f":"IF('00'!F38=\"\",\"\",'00'!F38)","v":10},{"$f":"SUM(F38:F41)","v":10},null,null,null,null,null,null,{"$f":"IF(B38=\"\",\"\",IF(E38>F38,\"! ? !\",\"OK\"))","v":"OK"},null,{"$f":"IF(AND(B38=\" -\",E38<>0),\"! ? !\",\"OK\")","v":"OK"}]
[null,{"$f":"IF('00'!B39=\"\",\" -\",'00'!B39)","v":"Arrêt du troupeau / Stop 2"},null,null,null,{"$f":"IF('00'!F39=\"\",\"\",'00'!F39)","v":""},null,null,null,null,null,null,null,{"$f":"IF(B39=\"\",\"\",IF(E39>F39,\"! ? !\",\"OK\"))","v":"OK"},null,{"$f":"IF(AND(B39=\" -\",E39<>0),\"! ? !\",\"OK\")","v":"OK"}]
[null,{"$f":"IF('00'!B40=\"\",\" -\",'00'!B40)","v":"Arrêt du troupeau / Stop 3"},null,null,null,{"$f":"IF('00'!F40=\"\",\"\",'00'!F40)","v":""},null,null,null,null,null,null,null,{"$f":"IF(B40=\"\",\"\",IF(E40>F40,\"! ? !\",\"OK\"))","v":"OK"},null,{"$f":"IF(AND(B40=\" -\",E40<>0),\"! ? !\",\"OK\")","v":"OK"}]
[null,{"$f":"IF('00'!B41=\"\",\" -\",'00'!B41)","v":" -"},null,null,null,{"$f":"IF('00'!F41=\"\",\"\",'00'!F41)","v":""},null,null,null,null,null,null,null,{"$f":"IF(B41=\"\",\"\",IF(E41>F41,\"! ? !\",\"OK\"))","v":"OK"},null,{"$f":"IF(AND(B41=\" -\",E41<>0),\"! ? !\",\"OK\")","v":"OK"}]
[null,{"$f":"IF('00'!B42=\"\",\" -\",'00'!B42)","v":" -"}]
[null,{"$f":"IF('00'!B43=\"\",\" -\",'00'!B43)","v":"Aptitude naturelle / Natural ability "},null,{"$f":"IF('00'!D43=\"\",\"\",'00'!D43)","v":10},null,{"$f":"IF('00'!F43=\"\",\"\",'00'!F43)","v":3},{"$f":"SUM(F43:F47)","v":10},null,null,null,null,null,null,{"$f":"IF(B43=\"\",\"\",IF(E43>F43,\"! ? !\",\"OK\"))","v":"OK"},null,{"$f":"IF(AND(B43=\" -\",E43<>0),\"! ? !\",\"OK\")","v":"OK"}]
[null,{"$f":"IF('00'!B44=\"\",\" -\",'00'!B44)","v":"Absence d’agressivité/ gentleness "},null,null,null,{"$f":"IF('00'!F44=\"\",\"\",'00'!F44)","v":2},null,null,null,null,null,null,null,"OK",null,"OK"]
[null,{"$f":"IF('00'!B45=\"\",\" -\",'00'!B45)","v":"Intelligence d’exécution/ Intelligence of execution  "},null,null,null,{"$f":"IF('00'!F45=\"\",\"\",'00'!F45)","v":2},null,null,null,null,null,null,null,"OK",null,"OK"]
[null,{"$f":"IF('00'!B46=\"\",\" -\",'00'!B46)","v":"Obéissance / Obedience "},null,null,null,{"$f":"IF('00'!F46=\"\",\"\",'00'!F46)","v":3},null,null,null,null,null,null,null,"OK",null,"OK"]
[null,{"$f":"IF('00'!B47=\"\",\" -\",'00'!B47)","v":" -"},null,null,null,{"$f":"IF('00'!F47=\"\",\"\",'00'!F47)","v":""},null,null,null,null,null,null,null,"OK",null,"OK"]
[null,{"$f":"IF('00'!B48=\"\",\" -\",'00'!B48)","v":" -"},null,{"$f":"IF('00'!D48=\"\",\"\",'00'!D48)","v":""},null,{"$f":"IF('00'!F48=\"\",\"\",'00'!F48)","v":""},{"$f":"SUM(F48:F50)","v":0},null,null,null,null,null,null,"OK",null,"OK"]
[null,{"$f":"IF('00'!B49=\"\",\" -\",'00'!B49)","v":" -"},null,null,null,{"$f":"IF('00'!F49=\"\",\"\",'00'!F49)","v":""},null,null,null,null,null,null,null,"OK",null,"OK"," "]
[null,{"$f":"IF('00'!B50=\"\",\" -\",'00'!B50)","v":" -"},null,null,null,{"$f":"IF('00'!F50=\"\",\"\",'00'!F50)","v":""},null,null,null,null,null,null,null,"OK",null,"OK"]
[null,"Pointage du Travail  ==>  ",null,null,{"$f":"SUM(E17:E50)","v":0},{"$f":"SUM(F17:F50)","v":100},null,null,"Temps = "]
[null,"Pénalités Générales :\n(chiffre négatif)    .",null,null,null,null,null,"Informations sur les pénalités générales :\n   \n   \n   ",null,null,"Classement :",null,null,{"$f":"IF(E52=\"\",\"\",IF(E52>0,\"ATTENTION : 'Pénalité Générales' doit être un nombre négatif ! \",\"OK\"))","v":""}]
[null,"TOTAL GENERAL =",null,null,{"$f":"IF(COUNT(E17:E50)=0,\"-\",E51+E52)","v":"-"},null,null,"Qualificatif :",{"$f":"IF(E53=\"-\",\"-\",IF(E53>89.9999,\"EXCELLENT\",IF(E53>79.9999,\"TRES BON\",IF(E53>69.999,\"BON\",IF(E53>59.999,\"Satisfaisant\",IF(E53>0.1,\"insuffisant \",\"éliminé \"))))))","v":"-"},null,{"$f":"Fiche_organisateur_N°2!P36","v":"X"},{"$f":"'Rapport de Concours'!D40","v":0}]
[null,"CACITR / RCACITR / CACTR / RCACTR :",null,null," -",null,null," <== sur décision du juge "]
[null,"Observations :  ",null,null,null,null,null,null,null,null,null,null,{"$f":"M51+M52","v":0}]
[]
[null,null,null,null,null,null,null,null,"Le Juge :",{"$f":"Fiche_organisateur_N°1!E28","v":0}]