{"text_format":"1","workbook":"xlsx","n_sheets":24,"sheets":["Fiche organisateur N1","Fiche organisateur N2","Rapport de concours ","CODE FCI","SCC","00","01","02","03","04","05","06","07","08","09","10","11","12","13","14","15","16","17","18"],"not_rendered":{"charts":0,"images":2,"macros":1,"external_links":1,"defined_names":22,"comments":2,"pivot_tables":0},"unopened":[],"bounds":{"document_bytes":16777216,"sheet_cells":100000,"rows_first":2000,"rows_last":500,"rows_between":2000,"halvings":0,"cell_chars":16384,"cell_head_chars":4096},"cells_cut":0,"cells_raw":0,"read":"whole","date_system":"1900"}

{"sheet":"Fiche organisateur N1","index":0,"n_rows":26,"n_cols":22,"rows_kept":26,"cut":false,"hidden":false,"merged":[[1,2,1,8],[2,2,2,8],[7,2,7,8],[9,2,9,8]]}
[]
[]
[]
[]
[]
[]
[]
[null,null,"TRADITIONAL STYLE "]
[]
[null,null,"Organisateur ==> Fiche N°1"]
[]
[]
[null,null,null,"Date : ",null,null," [ JJ.MM.AAAA ]"]
[null,null,null,"ORGANISATION : "]
[null,null,null,"Ville",null,null,null,null,null,null,null,null,null,null,null,null,null,null,null,1]
[null,null,null,"Contact : ",null,null,null,null,null,null,null,null,null,null,null,null,null,null,null,2]
[null,null,null,null,null,null,null,null,null,null,null,null,null,null,null,null,null,null,null,3,null,0]
[null,null,null,"E-mail : "]
[null,null,null,"Tel"]
[null,null,null,"adresse évènement "]
[null,null,null,"Juge"]
[]
[]
[]
[]
[null,null,null,"IHT","HWT"]

{"sheet":"Fiche organisateur N2","index":1,"n_rows":37,"n_cols":17,"rows_kept":37,"cut":false,"hidden":false,"merged":[[13,1,13,12],[0,3,0,12],[1,3,1,12],[3,3,3,10],[7,10,7,11]]}
[]
[]
[]
[null,null,null," TRADITIONAL STYLE ",null,null,null,null,null,null,null,{"$f":"\"IHT\"","v":"IHT"},{"$f":"'Fiche organisateur N1'!$E$26","v":"HWT"},null,null,null,"Secrétariat : vous pouvez faire vos remarques dans ce cadre"]
[null,null,null,null,"Date : ",{"$f":"'Rapport de concours '!H5","v":0}]
[null,null,null,null,"ORGANISATION : ",{"$f":"'Rapport de concours '!H6","v":0},null,null,null,null,null,null,null,null,null,null,"Note : sur cette feuille, vous pouvez ajuster les largeurs de colonnes…"]
[null,null,null,null,"Ville",{"$f":"'Rapport de concours '!H7","v":0}]
[null,null,null,null,"Contact : ",{"$f":"'Rapport de concours '!H8","v":0},"EVENTS DATE",{"$f":"'Fiche organisateur N1'!$E$13","v":0},null,null,"-"]
[null,null,null,null,null,{"$f":"'Rapport de concours '!H9","v":0}]
[null,null,null,null,"E-mail : ",{"$f":"'Rapport de concours '!H10","v":0}]
[null,null,null,null,"Tel",{"$f":"'Rapport de concours '!H11","v":0}]
[null,null,null,null,"adresse évènement ",{"$f":"'Rapport de concours '!H12","v":0}]
[]
[null,"Organisateur ==> Fiche  N°2"]
[]
[null,"START N°","Propriétaires","Conducteurs","Noms des Chiens","Affixe","Races + Sexe","FCI Code","Livre National","PEDIGREE N°","FAPAC","Identifiant","Carnet de travail"]
[]
[]
[]
[]
[]
[]
[]
[]
[]
[]
[]
[]
[]
[]
[]
[]
[]
[]
[]
[]
[null,null,null,"NE  PAS  UTILISER  CETTE  FICHE  COMME  RAPPORT  DE  CONCOURS  !"]

{"sheet":"Rapport de concours ","index":2,"n_rows":44,"n_cols":32,"rows_kept":44,"cut":false,"hidden":false,"merged":[[41,1,41,14],[0,3,0,13],[1,3,1,11],[3,3,3,9],[4,11,4,13],[13,1,13,13]]}
[]
[]
[]
[null,null,null,null,null,null,null,null,null,null,"IHT",{"$f":"'Fiche organisateur N1'!$E$26","v":"HWT"}]
[null,null,null,null,null,null,"Date : ",{"$f":"'Fiche organisateur N1'!E14","v":0},null,null,"Date",{"$f":"'Fiche organisateur N1'!$E$13","v":0}]
[null,null,null,null,null,null,"ORGANISATION : ",{"$f":"'Fiche organisateur N1'!E15","v":0}]
[null,null,null,null,null,null,"Ville",{"$f":"'Fiche organisateur N1'!E16","v":0}]
[null,null,null,null,null,null,"Contact : ",{"$f":"'Fiche organisateur N1'!E17","v":0}]
[null,null,null,null,null,null,null,{"$f":"'Fiche organisateur N1'!E18","v":0}]
[null,null,null,null,null,null,"E-mail : ",{"$f":"'Fiche organisateur N1'!E19","v":0}]
[null,null,null,null,null,null,"Tel",{"$f":"'Fiche organisateur N1'!E20","v":0}]
[null,null,null,null,null,null,"adresse évènement ",{"$f":"'Fiche organisateur N1'!E21","v":0}]
[]
[null,"RAPPORT DE CONCOURS "]
[]
[null,null,"Propriétaires","Conducteurs","Noms des Chiens","Affixe","Races + Sexe","N° FAPAC","Identifiants","FCI CODE","POINTS","Evaluation1","Evaluation2","Classement",null,{"$f":"'Fiche organisateur N2'!I16","v":"Livre National"},{"$f":"'Fiche organisateur N2'!J16","v":"PEDIGREE N°"}]
[null,{"$f":"IF(N17=\"X\",\"-\",N17)","v":"-"},{"$f":"'Fiche organisateur N2'!C17","v":0},{"$f":"'Fiche organisateur N2'!D17","v":0},{"$f":"'Fiche organisateur N2'!E17","v":0},{"$f":"'Fiche organisateur N2'!F17","v":0},{"$f":"'Fiche organisateur N2'!G17","v":0},{"$f":"'Fiche organisateur N2'!K22","v":0},{"$f":"'Fiche organisateur N2'!L17","v":0},{"$f":"'Fiche organisateur N2'!H17","v":0},{"$f":"'01'!$B$38","v":"-"},{"$f":"'01'!$F$38","v":"-"},{"$f":"'01'!$B$39","v":"."},{"$f":"IF(K17=\"-\",\"X\",IF(K17=0,\"N.C.\",_xlfn.RANK.EQ(K17,$K$17:$K$34,0)))","v":"X"},{"$f":"'01'!$F$38","v":"-"},{"$f":"'Fiche organisateur N2'!I17","v":0},{"$f":"'Fiche organisateur N2'!J17","v":0}]
[null,"-",{"$f":"'Fiche organisateur N2'!C18","v":0},{"$f":"'Fiche organisateur N2'!D18","v":0},{"$f":"'Fiche organisateur N2'!E18","v":0},{"$f":"'Fiche organisateur N2'!F18","v":0},{"$f":"'Fiche organisateur N2'!G18","v":0},{"$f":"'Fiche organisateur N2'!K17","v":0},{"$f":"'Fiche organisateur N2'!L18","v":0},{"$f":"'Fiche organisateur N2'!H18","v":0},{"$f":"'02'!$B$38","v":"-"},{"$f":"'01'!$F$38","v":"-"},{"$f":"'01'!$B$39","v":"."},"X",{"$f":"'02'!$F$38","v":"-"},{"$f":"'Fiche organisateur N2'!I18","v":0},{"$f":"'Fiche organisateur N2'!J18","v":0}]
[null,"-",{"$f":"'Fiche organisateur N2'!C19","v":0},{"$f":"'Fiche organisateur N2'!D19","v":0},{"$f":"'Fiche organisateur N2'!E19","v":0},{"$f":"'Fiche organisateur N2'!F19","v":0},{"$f":"'Fiche organisateur N2'!G19","v":0},{"$f":"'Fiche organisateur N2'!K18","v":0},{"$f":"'Fiche organisateur N2'!L19","v":0},{"$f":"'Fiche organisateur N2'!H19","v":0},{"$f":"'03'!$B$38","v":"-"},{"$f":"'01'!$F$38","v":"-"},{"$f":"'01'!$B$39","v":"."},"X",{"$f":"'03'!$F$38","v":"-"},{"$f":"'Fiche organisateur N2'!I19","v":0},{"$f":"'Fiche organisateur N2'!J19","v":0}]
[null,"-",{"$f":"'Fiche organisateur N2'!C20","v":0},{"$f":"'Fiche organisateur N2'!D20","v":0},{"$f":"'Fiche organisateur N2'!E20","v":0},{"$f":"'Fiche organisateur N2'!F20","v":0},{"$f":"'Fiche organisateur N2'!G20","v":0},{"$f":"'Fiche organisateur N2'!K19","v":0},{"$f":"'Fiche organisateur N2'!L20","v":0},{"$f":"'Fiche organisateur N2'!H20","v":0},{"$f":"'04'!$B$38","v":"-"},{"$f":"'01'!$F$38","v":"-"},{"$f":"'01'!$B$39","v":"."},"X",{"$f":"'04'!$F$38","v":"-"},{"$f":"'Fiche organisateur N2'!I20","v":0},{"$f":"'Fiche organisateur N2'!J20","v":0},null,{"$f":"'01'!$F$38","v":"-"},null,null,null,null,null,null,"IHT1",100,{"$f":"AA20*89.999/100","v":89.998999999999995},{"$f":"AA20*79.999/100","v":79.998999999999995},{"$f":"AA20*69.999/100","v":69.998999999999995},{"$f":"AA20*59.999/100","v":59.999000000000002},0.1]
[null,"-",{"$f":"'Fiche organisateur N2'!C21","v":0},{"$f":"'Fiche organisateur N2'!D21","v":0},{"$f":"'Fiche organisateur N2'!E21","v":0},{"$f":"'Fiche organisateur N2'!F21","v":0},{"$f":"'Fiche organisateur N2'!G21","v":0},{"$f":"'Fiche organisateur N2'!K20","v":0},{"$f":"'Fiche organisateur N2'!L21","v":0},{"$f":"'Fiche organisateur N2'!H21","v":0},{"$f":"'05'!$B$38","v":"-"},{"$f":"'01'!$F$38","v":"-"},{"$f":"'01'!$B$39","v":"."},"X",{"$f":"'05'!$F$38","v":"-"},{"$f":"'Fiche organisateur N2'!I21","v":0},{"$f":"'Fiche organisateur N2'!J21","v":0},null,null,null,null,null,null,null,null,"iIHT2",120,{"$f":"AA21*89.999/100","v":107.99879999999999},{"$f":"AA21*79.999/100","v":95.998799999999989},{"$f":"AA21*69.999/100","v":83.998799999999989},{"$f":"AA21*59.999/100","v":71.998800000000003},0.1]
[null,"-",{"$f":"'Fiche organisateur N2'!C22","v":0},{"$f":"'Fiche organisateur N2'!D22","v":0},{"$f":"'Fiche organisateur N2'!E22","v":0},{"$f":"'Fiche organisateur N2'!F22","v":0},{"$f":"'Fiche organisateur N2'!G22","v":0},{"$f":"'Fiche organisateur N2'!K21","v":0},{"$f":"'Fiche organisateur N2'!L22","v":0},{"$f":"'Fiche organisateur N2'!H22","v":0},{"$f":"'06'!$B$38","v":"-"},{"$f":"'01'!$F$38","v":"-"},{"$f":"'01'!$B$39","v":"."},"X",{"$f":"'06'!$F$38","v":"-"},{"$f":"'Fiche organisateur N2'!I22","v":0},{"$f":"'Fiche organisateur N2'!J22","v":0},null,null,null,null,null,null,null,null,"IHT3",150,134.99849999999998,{"$f":"AA22*79.999/100","v":119.99849999999998},{"$f":"AA22*69.999/100","v":104.99849999999998},{"$f":"AA22*59.999/100","v":89.998500000000007},0.1]
[null,"-",{"$f":"'Fiche organisateur N2'!C23","v":0},{"$f":"'Fiche organisateur N2'!D23","v":0},{"$f":"'Fiche organisateur N2'!E23","v":0},{"$f":"'Fiche organisateur N2'!F23","v":0},{"$f":"'Fiche organisateur N2'!G23","v":0},{"$f":"'Fiche organisateur N2'!K23","v":0},{"$f":"'Fiche organisateur N2'!L23","v":0},{"$f":"'Fiche organisateur N2'!H23","v":0},{"$f":"'07'!$B$38","v":"-"},{"$f":"'01'!$F$38","v":"-"},{"$f":"'01'!$B$39","v":"."},"X",{"$f":"'07'!$F$38","v":"-"},{"$f":"'Fiche organisateur N2'!I23","v":0},{"$f":"'Fiche organisateur N2'!J23","v":0}]
[null,"-",{"$f":"'Fiche organisateur N2'!C24","v":0},{"$f":"'Fiche organisateur N2'!D24","v":0},{"$f":"'Fiche organisateur N2'!E24","v":0},{"$f":"'Fiche organisateur N2'!F24","v":0},{"$f":"'Fiche organisateur N2'!G24","v":0},{"$f":"'Fiche organisateur N2'!K24","v":0},{"$f":"'Fiche organisateur N2'!L24","v":0},{"$f":"'Fiche organisateur N2'!H24","v":0},{"$f":"'08'!$B$38","v":"-"},{"$f":"'01'!$F$38","v":"-"},{"$f":"'01'!$B$39","v":"."},"X",{"$f":"'08'!$F$38","v":"-"},{"$f":"'Fiche organisateur N2'!I24","v":0},{"$f":"'Fiche organisateur N2'!J24","v":0}]
[null,"-",{"$f":"'Fiche organisateur N2'!C25","v":0},{"$f":"'Fiche organisateur N2'!D25","v":0},{"$f":"'Fiche organisateur N2'!E25","v":0},{"$f":"'Fiche organisateur N2'!F25","v":0},{"$f":"'Fiche organisateur N2'!G25","v":0},{"$f":"'Fiche organisateur N2'!K25","v":0},{"$f":"'Fiche organisateur N2'!L25","v":0},{"$f":"'Fiche organisateur N2'!H25","v":0},{"$f":"'09'!$B$38","v":"-"},{"$f":"'01'!$F$38","v":"-"},{"$f":"'01'!$B$39","v":"."},"X",{"$f":"'09'!$F$38","v":"-"},{"$f":"'Fiche organisateur N2'!I25","v":0},{"$f":"'Fiche organisateur N2'!J25","v":0}]
[null,"-",{"$f":"'Fiche organisateur N2'!C26","v":0},{"$f":"'Fiche organisateur N2'!D26","v":0},{"$f":"'Fiche organisateur N2'!E26","v":0},{"$f":"'Fiche organisateur N2'!F26","v":0},{"$f":"'Fiche organisateur N2'!G26","v":0},{"$f":"'Fiche organisateur N2'!K26","v":0},{"$f":"'Fiche organisateur N2'!L26","v":0},{"$f":"'Fiche organisateur N2'!H26","v":0},{"$f":"'10'!$B$38","v":"-"},{"$f":"'01'!$F$38","v":"-"},{"$f":"'01'!$B$39","v":"."},"X",{"$f":"'10'!$F$38","v":"-"},{"$f":"'Fiche organisateur N2'!I26","v":0},{"$f":"'Fiche organisateur N2'!J26","v":0}]
[null,"-",{"$f":"'Fiche organisateur N2'!C27","v":0},{"$f":"'Fiche organisateur N2'!D27","v":0},{"$f":"'Fiche organisateur N2'!E27","v":0},{"$f":"'Fiche organisateur N2'!F27","v":0},{"$f":"'Fiche organisateur N2'!G27","v":0},{"$f":"'Fiche organisateur N2'!K27","v":0},{"$f":"'Fiche organisateur N2'!L27","v":0},{"$f":"'Fiche organisateur N2'!H27","v":0},{"$f":"'11'!$B$38","v":"-"},{"$f":"'01'!$F$38","v":"-"},{"$f":"'01'!$B$39","v":"."},"X",{"$f":"'11'!$F$38","v":"-"},{"$f":"'Fiche organisateur N2'!I27","v":0},{"$f":"'Fiche organisateur N2'!J27","v":0}]
[null,"-",{"$f":"'Fiche organisateur N2'!C28","v":0},{"$f":"'Fiche organisateur N2'!D28","v":0},{"$f":"'Fiche organisateur N2'!E28","v":0},{"$f":"'Fiche organisateur N2'!F28","v":0},{"$f":"'Fiche organisateur N2'!G28","v":0},{"$f":"'Fiche organisateur N2'!K28","v":0},{"$f":"'Fiche organisateur N2'!L28","v":0},{"$f":"'Fiche organisateur N2'!H28","v":0},{"$f":"'12'!$B$38","v":"-"},{"$f":"'01'!$F$38","v":"-"},{"$f":"'01'!$B$39","v":"."},"X",{"$f":"'12'!$F$38","v":"-"},{"$f":"'Fiche organisateur N2'!I28","v":0},{"$f":"'Fiche organisateur N2'!J28","v":0}]
[null,"-",{"$f":"'Fiche organisateur N2'!C29","v":0},{"$f":"'Fiche organisateur N2'!D29","v":0},{"$f":"'Fiche organisateur N2'!E29","v":0},{"$f":"'Fiche organisateur N2'!F29","v":0},{"$f":"'Fiche organisateur N2'!G29","v":0},{"$f":"'Fiche organisateur N2'!K29","v":0},{"$f":"'Fiche organisateur N2'!L29","v":0},{"$f":"'Fiche organisateur N2'!H29","v":0},{"$f":"'13'!$B$38","v":"-"},{"$f":"'01'!$F$38","v":"-"},{"$f":"'01'!$B$39","v":"."},"X",{"$f":"'13'!$F$38","v":"-"},{"$f":"'Fiche organisateur N2'!I29","v":0},{"$f":"'Fiche organisateur N2'!J29","v":0}]
[null,"-",{"$f":"'Fiche organisateur N2'!C30","v":0},{"$f":"'Fiche organisateur N2'!D30","v":0},{"$f":"'Fiche organisateur N2'!E30","v":0},{"$f":"'Fiche organisateur N2'!F30","v":0},{"$f":"'Fiche organisateur N2'!G30","v":0},{"$f":"'Fiche organisateur N2'!K30","v":0},{"$f":"'Fiche organisateur N2'!L30","v":0},{"$f":"'Fiche organisateur N2'!H30","v":0},{"$f":"'14'!$B$38","v":"-"},{"$f":"'01'!$F$38","v":"-"},{"$f":"'01'!$B$39","v":"."},"X",{"$f":"'14'!$F$38","v":"-"},{"$f":"'Fiche organisateur N2'!I30","v":0},{"$f":"'Fiche organisateur N2'!J30","v":0}]
[null,"-",{"$f":"'Fiche organisateur N2'!C31","v":0},{"$f":"'Fiche organisateur N2'!D31","v":0},{"$f":"'Fiche organisateur N2'!E31","v":0},{"$f":"'Fiche organisateur N2'!F31","v":0},{"$f":"'Fiche organisateur N2'!G31","v":0},{"$f":"'Fiche organisateur N2'!K31","v":0},{"$f":"'Fiche organisateur N2'!L31","v":0},{"$f":"'Fiche organisateur N2'!H31","v":0},{"$f":"'15'!$B$38","v":"-"},{"$f":"'01'!$F$38","v":"-"},{"$f":"'01'!$B$39","v":"."},"X",{"$f":"'15'!$F$38","v":"-"},{"$f":"'Fiche organisateur N2'!I31","v":0},{"$f":"'Fiche organisateur N2'!J31","v":0}]
[null,"-",{"$f":"'Fiche organisateur N2'!C32","v":0},{"$f":"'Fiche organisateur N2'!D32","v":0},{"$f":"'Fiche organisateur N2'!E32","v":0},{"$f":"'Fiche organisateur N2'!F32","v":0},{"$f":"'Fiche organisateur N2'!G32","v":0},{"$f":"'Fiche organisateur N2'!K32","v":0},{"$f":"'Fiche organisateur N2'!L32","v":0},{"$f":"'Fiche organisateur N2'!H32","v":0},{"$f":"'16'!$B$38","v":"-"},{"$f":"'01'!$F$38","v":"-"},{"$f":"'01'!$B$39","v":"."},"X",{"$f":"'16'!$F$38","v":"-"},{"$f":"'Fiche organisateur N2'!I32","v":0},{"$f":"'Fiche organisateur N2'!J32","v":0}]
[null,"-",{"$f":"'Fiche organisateur N2'!C33","v":0},{"$f":"'Fiche organisateur N2'!D33","v":0},{"$f":"'Fiche organisateur N2'!E33","v":0},{"$f":"'Fiche organisateur N2'!F33","v":0},{"$f":"'Fiche organisateur N2'!G33","v":0},{"$f":"'Fiche organisateur N2'!K33","v":0},{"$f":"'Fiche organisateur N2'!L33","v":0},{"$f":"'Fiche organisateur N2'!H33","v":0},{"$f":"'17'!$B$38","v":"-"},{"$f":"'01'!$F$38","v":"-"},{"$f":"'01'!$B$39","v":"."},"X",{"$f":"'17'!$F$38","v":"-"},{"$f":"'Fiche organisateur N2'!I33","v":0},{"$f":"'Fiche organisateur N2'!J33","v":0}]
[null,"-",{"$f":"'Fiche organisateur N2'!C34","v":0},{"$f":"'Fiche organisateur N2'!D34","v":0},{"$f":"'Fiche organisateur N2'!E34","v":0},{"$f":"'Fiche organisateur N2'!F34","v":0},{"$f":"'Fiche organisateur N2'!G34","v":0},{"$f":"'Fiche organisateur N2'!K34","v":0},{"$f":"'Fiche organisateur N2'!L34","v":0},{"$f":"'Fiche organisateur N2'!H34","v":0},{"$f":"'18'!$B$38","v":"-"},{"$f":"'01'!$F$38","v":"-"},{"$f":"'01'!$B$39","v":"."},"X",{"$f":"'18'!$F$38","v":"-"},{"$f":"'Fiche organisateur N2'!I34","v":0},{"$f":"'Fiche organisateur N2'!J34","v":0}]
[]
[]
[null,null,null,{"$f":"COUNTA('Fiche organisateur N2'!E17:E34)","v":0},"(= inscrits)"]
[null,null,"Nombre de chiens",{"$f":"COUNT(K17:K34)","v":0},"(=entrés sur le terrain)",3,{"$f":"D38*F38","v":0}," <====  Montant de la redevance CC (chèque global à l'ordre de CC/ CUNTRP)  à joindre au présent rapport"]
[null,null,null,{"$f":"COUNT(K17:K34)-COUNTIF(K17:K34,\"=0\")","v":0},"(=ayant un score non nul)"]
[]
[]
[null,"Observations"]
[]
[null,null,null,null,null,null,null,"Judge",{"$f":"'Fiche organisateur N1'!F53","v":0},null,"Signature :"]

{"sheet":"CODE FCI","index":3,"n_rows":355,"n_cols":4,"rows_kept":355,"cut":false,"hidden":false,"merged":[]}
[]
[null," NOMS DE RACE FCI    (liste à jour au 28 mai 2015)","CODES RACE\nFCI"," NOMS DE RACE EN LANGUE D'ORIGINE"]
[null,"AFFENPINSCHER",186,"AFFENPINSCHER"]
[null,"AIREDALE TERRIER",7,"AIREDALE TERRIER"]
[null,"AKITA",255,"AKITA"]
[null,"AKITA AMERICAIN",344,"AMERICAN AKITA"]
[null,"ANGLO FRANCAIS DE PETITE VENERIE",325,"ANGLO FRANCAIS DE PETITE VENERIE"]
[null,"ARIEGEOIS",20,"ARIEGEOIS"]
[null,"AZAWAKH",307,"AZAWAKH"]
[null,"BANGKAEW DE THAILANDE",358,"THAI BANGKAEW DOG"]
[null,"BARBET",105,"BARBET"]
[null,"BARBU TCHEQUE",245,"CESKY FOUSEK"]
[null,"BARZOÏ",193,"RUSSKAYA PSOVAYA BORZAYA"]
[null,"BASENJI",43,"BASENJI"]
[null,"BASSET ARTESIEN NORMAND",34,"BASSET ARTESIEN NORMAND"]
[null,"BASSET BLEU DE GASCOGNE",35,"BASSET BLEU DE GASCOGNE"]
[null,"BASSET DE WESTPHALIE",100,"WESTFÄLISCHE DACHSBRACKE"]
[null,"BASSET DES ALPES",254,"ALPENLÄNDISCHE DACHSBRACKE"]
[null,"BASSET FAUVE DE BRETAGNE",36,"BASSET FAUVE DE BRETAGNE"]
[null,"BASSET HOUND",163,"BASSET HOUND"]
[null,"BASSET SUEDOIS",130,"DREVER"]
[null,"BEAGLE",161,"BEAGLE"]
[null,"BEAGLE HARRIER",290,"BEAGLE HARRIER"]
[null,"BEARDED COLLIE",271,"BEARDED COLLIE"]
[null,"BEDLINGTON TERRIER",9,"BEDLINGTON TERRIER"]
[null,"BERGER ALLEMAND",166,"DEUTSCHER SCHÄFERHUND"]
[null,"BERGER AMERICAIN MINIATURE",916,"AMERICAN SHEPERD MINIATURE"]
[null,"BERGER AUSTRALIEN",342,"AUSTRALIAN SHEPHERD"]
[null,"BERGER BERGAMASQUE",194,"CANE DA PASTORE BERGAMASCO"]
[null,"BERGER BLANC SUISSE",347,"BERGER BLANC SUISSE / WEISSER SCHWEIZER SCHAFERHUND"]
[null,"BERGER D'ASIE CENTRALE",335,"SREDNEASIATSKAÏA OVTCHARKA"]
[null,"BERGER DE BEAUCE",44,"BERGER DE BEAUCE"]
[null,"BERGER DE BOSNIE-HERZEGOVINE ET DE CROATIE",355,"TORNJAK"]
[null,"BERGER DE BRIE",113,"BERGER DE BRIE"]
[null,"BERGER DE LA MAREMME ET DES ABRUZZES",201,"CANE DA PASTORE MAREMMANO-ABRUZZESE"]
[null,"BERGER DE LA SERRA DE AIRES",93,"CÃO DA SERRA DE AIRES"]
[null,"BERGER DE L'EUROPE DU SUD-EST",357,"CIOBANESC ROMANESC DE BUCOVINA"]
[null,"BERGER DE PICARDIE",176,""]
[null,"BERGER DE RUSSIE MERIDIONALE",326,"IOUJNOROUSSKAÏA OVTCHARKA"]
[null,"BERGER DES PYRENEES A FACE RASE",138,"BERGER DES PYRENEES A FACE RASE"]
[null,"BERGER DES PYRENEES A POIL LONG",141,"BERGER DES PYRENEES A POIL LONG"]
[null,"BERGER DU CAUCASE",328,"KAVKAZSKAÏA OVTCHARKA"]
[null,"BERGER DU KARST",278,"KRASZKI OVCAR"]
[null,"BERGER FINNOIS DE LAPONIE",284,"LAPINPOROKOIRA"]
[null,"BERGER HOLLANDAIS",223,"HOLLANDSE HERDERSHOND"]
[null,"BERGER POLONAIS DE PLAINE",251,"POLSKI OWCZAREK NIZINNY"]
[null,"BICHON A POIL FRISE",215,""]
[null,"BICHON BOLONAIS",196,"BOLOGNESE"]
[null,"BICHON HAVANAIS",250,"BICHON HAVANAIS"]
[null,"BICHON MALTAIS",65,"MALTESE"]
[null,"BILLY",25,"BILLY"]
[null,"BORDER COLLIE",297,"BORDER COLLIE"]
[null,"BORDER TERRIER",10,"BORDER TERRIER"]
[null,"BOULEDOGUE FRANCAIS",101,"BOULEDOGUE FRANCAIS"]
[null,"BOUVIER AUSTRALIEN",287,"AUSTRALIAN CATTLE DOG"]
[null,"BOUVIER AUSTRALIEN COURTE QUEUE",351,"AUSTRALIAN STUMPY TAIL CATTLE DOG"]
[null,"BOUVIER BERNOIS",45,"BERNER SENNENHUND , DÜRRBÄCHLER"]
[null,"BOUVIER DE L'APPENZELL",46,"APPENZELLER SENNENHUND"]
[null,"BOUVIER DE L'ENTLEBUCH",47,"ENTLEBUCHER SENNENHUND"]
[null,"BOUVIER DES ARDENNES",171,"BOUVIER DES ARDENNES"]
[null,"BOUVIER DES FLANDRES",191,"BOUVIER DES FLANDRES"]
[null,"BOXER",144,"BOXER"]
[null,"BRACHET ALLEMAND",299,"DEUTSCHE BRACKE"]
[null,"BRACHET DE STYRIE A POIL DUR",62,"STEIRISCHE RAUHHAARBRACKE"]
[null,"BRACHET NOIR ET FEU",63,"BRANDLBRACKE"]
[null,"BRACHET POLONAIS",52,"OGAR POLSKI"]
[null,"BRACHET TYROLIEN",68,"TIROLER BRACKE"]
[null,"BRAQUE ALLEMAND A POIL COURT",119,"DEUTSCH KURZHAAR"]
[null,"BRAQUE D AUVERGNE",180,"BRAQUE D'AUVERGNE"]
[null,"BRAQUE DE BURGOS",90,"PERDIGUERO DE BURGOS"]
[null,"BRAQUE DE L ARIEGE",177,"BRAQUE DE L'ARIEGE"]
[null,"BRAQUE DE WEIMAR",99,"WEIMARANER"]
[null,"BRAQUE DU BOURBONNAIS",179,"BRAQUE DU BOURBONNAIS"]
[null,"BRAQUE FRANCAIS, TYPE GASCOGNE",133,""]
[null,"BRAQUE FRANCAIS, TYPE PYRENEES",134,""]
[null,"BRAQUE HONGROIS A POIL COURT",57,"RÖVIDSZÖRU MAGYAR VIZSLA"]
[null,"BRAQUE HONGROIS A POIL DUR",239,"DRÖTZÖRÜ MAGYAR VIZSLA"]
[null,"BRAQUE ITALIEN",202,"BRACCO ITALIANO"]
[null,"BRAQUE SAINT GERMAIN",115,"BRAQUE SAINT GERMAIN"]
[null,"BRAQUE SLOVAQUE A POIL DUR",320,"SLOVENSKI HRUBOSRSTY STAVAC (OHAR)"]
[null,"BRIQUET DE PROVENCE",911,""]
[null,"BRIQUET GRIFFON VENDEEN",19,"BRIQUET GRIFFON VENDEEN"]
[null,"BROHOLMER",315,"BROHOLMER"]
[null,"BRUNO SAINT-HUBERT FRANCAIS",905,"JURA LAUFHUND - CHIEN COURANT"]
[null,"BUHUND NORVEGIEN",237,"NORSK BUHUND"]
[null,"BULL TERRIER",11,"BULL TERRIER"]
[null,"BULL TERRIER MINIATURE",359,"MINIATURE BULL TERRIER"]
[null,"BULLDOG",149,"BULLDOG"]
[null,"BULLMASTIFF",157,"BULLMASTIFF"]
[null,"CAIRN TERRIER",4,"CAIRN TERRIER"]
[null,"CANICHE",172,"CANICHE"]
[null,"CARLIN",253,"PUG"]
[null,"CAVALIER KING CHARLES",136,"CAVALIER KING CHARLES SPANIEL"]
[null,"CHIEN A LOUTRE",294,"OTTERHOUND"]
[null,"CHIEN CHINOIS A CRETE",288,"CHINESE CRESTED DOG"]
[null,"CHIEN COURANT DE BOSNIE A POIL DUR",155,"BOSANSKI OSTRODLAKI GONIC - BARAK"]
[null,"CHIEN COURANT DE HALDEN",267,"HALDENSTOVER"]
[null,"CHIEN COURANT DE HAMILTON",132,"HAMILTONSTOVARE"]
[null,"CHIEN COURANT DE HYGEN",266,"HYGENHUND"]
[null,"CHIEN COURANT DE LA VALLE DE LA SAVE",154,"POSAVSKI GONIC"]
[null,"CHIEN COURANT DE MONTAGNE DU MONTENEGRO",279,"CRNOGORSKI  PLANINSKI GONIC"]
[null,"CHIEN COURANT DE SCHILLER",131,"SCHILLERSTÖVARE"]
[null,"CHIEN COURANT DE TRANSYLVANIE",241,"ERDELYI KOPO"]
[null,"CHIEN COURANT D'ISTRIE A POIL DUR",152,"ISTARSKI OSTRODLAKI GONIC"]
[null,"CHIEN COURANT D'ISTRIE A POIL RAS",151,"ISTARSKI KRATKODLAKI GONIC"]
[null,"CHIEN COURANT DU SMALAND",129,"SMALANDSSTOVARE"]
[null,"CHIEN COURANT ESPAGNOL",204,"SABUESO ESPAÑOL"]
[null,"CHIEN COURANT FINLANDAIS",51,"SUOMENAJOKOIRA"]
[null,"CHIEN COURANT GREC",214,"HELLINIKOS ICHNILATIS"]
[null,"CHIEN COURANT ITALIEN A POIL DUR",198,"SEGUGIO ITALIANO A PELO FORTE"]
[null,"CHIEN COURANT ITALIEN A POIL RAS",337,"SEGUGIO ITALIANO A PELO RAZO"]
[null,"CHIEN COURANT NORVEGIEN",203,"DUNKER"]
[null,"CHIEN COURANT POLONAIS",354,"GONZCY POLSKI"]
[null,"CHIEN COURANT SERBE",150,"SERBSKI GONIC"]
[null,"CHIEN COURANT SLOVAQUE",244,"SLOVENSKY KOPOV"]
[null,"CHIEN COURANT SUISSE",59,"SCHWEIZER LAUFHUND"]
[null,"CHIEN COURANT TRICOLORE SERBE",229,"SERPSKI TROBOJNI GONIC"]
[null,"CHIEN D'ARRET ALLEMAND A POIL DUR",98,"DEUTSCH DRAHTHAAR"]
[null,"CHIEN D'ARRET ALLEMAND A POIL LONG",117," DEUTSCH LANGHAAR"]
[null,"CHIEN D'ARRET ALLEMAND A POIL RAIDE",232,"DEUTSCH STICHELHAAR"]
[null,"CHIEN D'ARRET DANOIS ANCESTRAL",281,"GAMMEL DANSK HONSHUND"]
[null,"CHIEN D'ARRET FRISON",222,"STABYHOUN"]
[null,"CHIEN D'ARRET PORTUGAIS",187,"PERDIGUEIRO PORTUGUES"]
[null,"CHIEN D'ARTOIS",28,"CHIEN D'ARTOIS"]
[null,"CHIEN DE BERGER ANGLAIS ANCESTRAL",16,"OLD ENGLISH SHEEPDOG"]
[null,"CHIEN DE BERGER BELGE",15,"BELGISCHE HERDERSHOND"]
[null,"CHIEN DE BERGER CATALAN",87,"PERRO DE PASTOR CATALAN - GOS D'ATURA CATALA"]
[null,"CHIEN DE BERGER CROATE",277,"HRVATSKI OVCAR"]
[null,"CHIEN DE BERGER D ANATOLIE",331,"COBAN KOPEGI"]
[null,"CHIEN DE BERGER DE MAJORQUE",321,"PERRO DE PASTOR MALLORQUIN - CA DE BESTIAR"]
[null,"CHIEN DE BERGER DES SHETLAND",88,"SHETLAND SHEEPDOG"]
[null,"CHIEN DE BERGER DES TATRAS",252,"POLSKI OWCZAREK PODHALANSKI"]
[null,"CHIEN DE BERGER ISLANDAIS",289,"ISLENSKUR FJARHUNDUR"]
[null,"CHIEN DE BERGER ROUMAIN DE MIORITZA",349,"CIOBANESC ROMÂNESC MIORITIC"]
[null,"CHIEN DE BERGER ROUMAIN DES CARPATHES",350,"CIOBANESC  ROMÂNESC CARPATIN"]
[null,"CHIEN DE BERGER YOUGOSLAVE DE CHARPLANINA",41,"JUGOSLOVENSKI OVCARSKI PAS"]
[null,"CHIEN DE CANAAN",273,"CANAAN DOG"]
[null,"CHIEN DE CASTRO LABOREIRO",170,"CAO DE CASTRO LABOREIRO"]
[null,"CHIEN DE COUR ITALIEN",343,"CANE CORSO"]
[null,"CHIEN DE FERME DANO-SUEDOIS",356,"DANSK-SVENSK GARDSHUND"]
[null,"CHIEN DE GARENNE DES CANARIES",329,"PODENCO CANARIO"]
[null,"CHIEN DE GARENNE PORTUGAIS",94,"PODENGO PORTUGUÈS"]
[null,"CHIEN DE LA SERRA DA ESTRELA",173,"CAO DA SERRA DA ESTRELA"]
[null,"CHIEN DE LEONBERG",145,"LEONBERGER"]
[null,"CHIEN DE MONTAGNE DE L'ATLAS",247,"AÏDI"]
[null,"CHIEN DE MONTAGNE DES PYRENEES",137,"CHIEN DE MONTAGNE DES PYRENEES"]
[null,"CHIEN DE PERDRIX DE DRENTE",224,"DRENTSCHE PATRIJSHOND"]
[null,"CHIEN DE RHODESIE A CRETE DORSALE",146,"RHODESIAN RIDGEBACK"]
[null,"CHIEN DE ROUGE DE BAVIERE",217,"BAYRISCHER GEBIRGSSCHWEISSHUND"]
[null,"CHIEN DE ROUGE DU HANOVRE",213,"HANNOVERSCHER SCHWEISSHUND"]
[null,"CHIEN DE SAINT HUBERT",84,"CHIEN DE SAINT HUBERT"]
[null,"CHIEN DE TAÏWAN",348,"TAÏWAN DOG"]
[null,"CHIEN D'EAU AMERICAIN",301,"AMERICAN WATER SPANIEL"]
[null,"CHIEN D'EAU ESPAGNOL",336,"PERRO DE AGUA ESPAÑOL"]
[null,"CHIEN D'EAU FRISON",221,"WETTERHOUN"]
[null,"CHIEN D'EAU PORTUGAIS",37,"CÃO DE AGUA PORTUGUÊS"]
[null,"CHIEN D'EAU ROMAGNOL",298,"LAGOTTO ROMAGNOLO"]
[null,"CHIEN D'ELAN NORVEGIEN GRIS",242,"NORSK ELKHUND GRA"]
[null,"CHIEN D'ELAN NORVEGIEN NOIR",268,"NORSK ELGHUND SORT"]
[null,"CHIEN D'ELAN SUEDOIS / JÄMTHUND",42,"JÄMTHUND"]
[null,"CHIEN D'OURS DE CARELIE",48,"KARJALANKARHUKOIRA"]
[null,"CHIEN D'OYSEL ALLEMAND",104,"DEUTSCHER WACHTELHUND"]
[null,"CHIEN DU GROENLAND",274,"GRONLANDSHUND"]
[null,"CHIEN DU PHARAON",248,"PHARAOH HOUND"]
[null,"CHIEN FINNOIS DE LAPONIE",189,"SUOMENLAPINKOIRA"]
[null,"CHIEN FONNESE",913,"CANE FONNESE"]
[null,"CHIEN LOUP DE SAARLOOS",311,"SAARLOOS WOLFHOND"]
[null,"CHIEN LOUP TCHECOSLOVAQUE",332,"CESKOSLOVENSKY VECIAK"]
[null,"CHIEN N. ET F. POUR LA CHASSE AU RATON",300,"BLACK AND TAN COONHOUND"]
[null,"CHIEN NORVEGIEN DE MACAREUX",265,"NORSK LUNDEHUND"]
[null,"CHIEN NU DU MEXIQUE",234,"XOLOITZCUINTLE"]
[null,"CHIEN NU DU PEROU",310,"PERRO SIN PELO DEL PERU"]
[null,"CHIEN PARTICOLORE A POIL FRISE",912,"CHIEN PARTICOLORE A POIL FRISE"]
[null,"CHIEN THAILANDAIS A CRETE DORSALE",338,"THAI RIDGEBACK DOG"]
[null,"CHIHUAHUA",218,"CHIHUAHUA"]
[null,"CHOW CHOW",205,"CHOW-CHOW"]
[null,"CIMARRON URUGUAYEN",353,"CIMARRON URUGUAYO"]
[null,"CIRNECO DE L ETNA",199,"CIRNECO DELL'ETNA"]
[null,"CLUMBER SPANIEL",109,"CLUMBER SPANIEL"]
[null,"COCKER SPANIEL AMERICAIN",167,"AMERICAN COCKER SPANIEL"]
[null,"COCKER SPANIEL ANGLAIS",5,"ENGLISH COCKER SPANIEL"]
[null,"COLLIE A POIL COURT",296,"SMOOTH COLLEY"]
[null,"COLLIE A POIL LONG",156,"ROUGH COLLEY"]
[null,"CONTINENTAL BULLDOG",915,"CONTINENTAL BULLDOG"]
[null,"COTON DE TULEAR",283,"COTON DE TULEAR"]
[null,"CROISE",null,"CROISE"]
[null,"CURSINU",901,"U'CURSINU"]
[null,"DALMATIEN",153,"DALMATIEN"]
[null,"DANDIE DINMONT TERRIER",168,"DANDIE DINMONT TERRIER"]
[null,"DOBERMANN",143,"DOBERMANN"]
[null,"DOGUE ALLEMAND",235,"DEUTSCHE DOGGE"]
[null,"DOGUE ARGENTIN",292,"DOGO ARGENTINO"]
[null,"DOGUE DE BORDEAUX",116,"DOGUE DE BORDEAUX"]
[null,"DOGUE DE MAJORQUE",249,"PERRO DOGO MALLORQUIN"]
[null,"DOGUE DES CANARIES",346,"DOGO CANARIO"]
[null,"DOGUE DU TIBET",230,"DO-KHYI"]
[null,"ENGLISH SPRINGER SPANIEL",125,"ENGLISH SPRINGER SPANIEL"]
[null,"EPAGNEUL BLEU DE PICARDIE",106,"EPAGNEUL BLEU DE PICARDIE"]
[null,"EPAGNEUL BRETON",95,"EPAGNEUL BRETON"]
[null,"EPAGNEUL DE PONT AUDEMER",114,"EPAGNEUL DE PONT AUDEMER"]
[null,"EPAGNEUL DE SAINT USUGE",906,"EPAGNEUL DE SAINT USUGE"]
[null,"EPAGNEUL D'EAU IRLANDAIS",124,"IRISH WATER SPANIEL"]
[null,"EPAGNEUL FRANCAIS",175,"EPAGNEUL FRANCAIS"]
[null,"EPAGNEUL JAPONAIS",206,"CHIN"]
[null,"EPAGNEUL KING CHARLES",128,"KING CHARLES SPANIEL"]
[null,"EPAGNEUL NAIN CONTINENTAL",77,""]
[null,"EPAGNEUL PEKINOIS",207,"PEKINGESE"]
[null,"EPAGNEUL PICARD",108,"EPAGNEUL PICARD"]
[null,"EPAGNEUL TIBETAIN",231,"TIBETAN SPANIEL"]
[null,"EURASIER",291,"EURASIEN"]
[null,"FIELD SPANIEL",123,"FIELD SPANIEL"]
[null,"FILA BRASILEIRO",225,"FILA BRASILEIRO"]
[null,"FILA DE SAINT  MIGUEL",340,"CAO DE FILA DE SAO MIGUEL"]
[null,"FOX HOUND ANGLAIS",159,"ENGLISH FOXHOUND"]
[null,"FOX TERRIER POIL DUR",169,"FOX TERRIER WIRE"]
[null,"FOX TERRIER POIL LISSE",12,"FOX TERRIER SMOOTH"]
[null,"FOXHOUND AMERICAIN",303,"AMERICAN FOXHOUND"]
[null,"FRANCAIS BLANC ET NOIR",220,"FRANCAIS"]
[null,"FRANCAIS BLANC ET ORANGE",316,""]
[null,"FRANCAIS TRICOLORE",219,"FRANCAIS"]
[null,"GASCON SAINTONGEOIS",21,"GASCON SAINTONGEOIS"]
[null,"GOLDEN RETRIEVER",111,"GOLDEN RETRIEVER"]
[null,"GRAND ANGLO FRANCAIS BLANC ET NOIR",323,"GRAND ANGLO FRANCAIS"]
[null,"GRAND ANGLO-FRANCAIS BLANC ET ORANGE",324,"GRAND ANGLO-FRANCAIS"]
[null,"GRAND ANGLO-FRANCAIS TRICOLORE",322,"GRAND ANGLO FRANCAIS"]
[null,"GRAND BASSET GRIFFON VENDEEN",33,"GRAND BASSET GRIFFON VENDEEN"]
[null,"GRAND BLEU DE GASCOGNE",22,"GRAND BLEU DE GASCOGNE"]
[null,"GRAND BOUVIER SUISSE",58,"GROSSER SCHWEIZER SENNENHUND"]
[null,"GRAND EPAGNEUL DE MUNSTER",118,"GROSSER MÜNSTERLÄNDER VORSTEHHUND"]
[null,"GRAND GRIFFON VENDEEN",282,"GRAND GRIFFON VENDEEN"]
[null,"GREYHOUND",158,"GREYHOUND"]
[null,"GRIFFON A POIL DUR KORTHALS",107,"GRIFFON A POIL DUR KORTHALS"]
[null,"GRIFFON BELGE",81,"GRIFFON BELGE"]
[null,"GRIFFON BLEU DE GASCOGNE",32,"GRIFFON BLEU DE GASCOGNE"]
[null,"GRIFFON BRUXELLOIS",80,"GRIFFON BRUXELLOIS"]
[null,"GRIFFON FAUVE DE BRETAGNE",66,"GRIFFON FAUVE DE BRETAGNE"]
[null,"GRIFFON NIVERNAIS",17,"GRIFFON NIVERNAIS"]
[null,"HARRIER",295,"HARRIER"]
[null,"HOKKAIDO",261,"HOKKAIDO"]
[null,"HOVAWART",190,"HOVAWART"]
[null,"HUSKY DE SIBERIE",270,"SIBERIAN HUSKY"]
[null,"JINDO COREEN",334,"KOREA JINDO DOG"]
[null,"KAI",317,"KAI"]
[null,"KELPIE AUSTRALIEN",293,"AUSTRALIAN KELPIE"]
[null,"KISHU",318,"KISHU"]
[null,"KOMONDOR",53,"KOMONDOR"]
[null,"KROMFOHRLANDER",192,"KROMFOHRLÄNDER"]
[null,"KUVASZ",54,"KUVASZ"]
[null,"LAIKA DE SIBERIE OCCIDENTALE",306,"ZAPADNO SIBIRSKAÏA LAÏKA"]
[null,"LAIKA DE SIBERIE ORIENTALE",305,"VOSTOTCHNO SIBIRSKAÏA LAÏKA"]
[null,"LAIKA RUSSO EUROPEEN",304,"RUSSKO EVROPEÏSKAÏA LAÏKA"]
[null,"LAKELAND TERRIER",70,"LAKELAND TERRIER"]
[null,"LANDSEER",226,"LANDSEER - TYPE CONTINENTAL EUROPEEN"]
[null,"LAPPHUND SUEDOIS",135,"SVENSK LAPPHUND"]
[null,"LEVRIER AFGHAN",228,"AFGHAN HOUND"]
[null,"LEVRIER ECOSSAIS",164,"DEERHOUND - SCOTTISH DEERHOUND"]
[null,"LEVRIER ESPAGNOL",285,"GALGO ESPAÑOL"]
[null,"LEVRIER HONGROIS",240,"MAGYAR AGAR"]
[null,"LEVRIER IRLANDAIS",160,"IRISH WOLFHOUND"]
[null,"LEVRIER POLONAIS",333,"CHART POLSKI"]
[null,"LHASSA APSO",227,"LHASSA APSO"]
[null,"MALAMUTE DE L'ALASKA",243,"ALASKAN MALAMUTE"]
[null,"MANCHESTER TERRIER",71,"MANCHESTER TERRIER"]
[null,"MASTIFF",264,"MASTIFF"]
[null,"MATIN DE L'ALENTEJO",96,"RAFEIRO DO ALENTEJO"]
[null,"MATIN DES PYRENEES",92,"MASTIN DEL PIRINEO"]
[null,"MATIN ESPAGNOL",91,"MASTIN ESPANOL"]
[null,"MATIN NAPOLITAIN",197,"MASTINO NAPOLETANO"]
[null,"MUDI",238,"MUDI"]
[null,"NORFOLK TERRIER",272,"NORFOLK TERRIER"]
[null,"NORWICH TERRIER",72,"NORWICH TERRIER"]
[null,"PETIT BASSET GRIFFON VENDEEN",67,"PETIT BASSET GRIFFON VENDEEN"]
[null,"PETIT BLEU DE GASCOGNE",31,"PETIT BLEU DE GASCOGNE"]
[null,"PETIT BRABANCON",82,"PETIT BRABANCON"]
[null,"PETIT CHIEN COURANT SUISSE",60,"SCHWEIZERISCHER NIEDERLAUFHUND"]
[null,"PETIT CHIEN HOLLANDAIS DE CHASSE AU GIBIER D'EAU",314,"KOOIKERHONDJE"]
[null,"PETIT CHIEN LION",233,"PETIT CHIEN LION"]
[null,"PETIT CHIEN RUSSE",352,"RUSSKIY TOY"]
[null,"PETIT EPAGNEUL DE MUNSTER",102,"KLEINER MÜNSTERLÄNDER VORSTEHHUND"]
[null,"PETIT LEVRIER ITALIEN",200,"PICCOLO LEVRIERO ITALIANO"]
[null,"PINSCHER ALLEMAND",184,"DEUTSCHER PINSCHER"]
[null,"PINSCHER AUTRICHIEN",64,"ÖSTERREICHISCHER PINSCHER"]
[null,"PINSCHER NAIN",185,"ZWERGPINSCHER"]
[null,"PODENCO D'IBIZA",89,"PODENCO IBICENCO"]
[null,"POINTER ANGLAIS",1,"ENGLISH POINTER"]
[null,"POITEVIN",24,"POITEVIN"]
[null,"PORCELAINE",30,"PORCELAINE"]
[null,"PUDELPOINTER",216,"PUDELPOINTER"]
[null,"PULI",55,"PULI"]
[null,"PUMI",56,"PUMI"]
[null,"RATIER DE PRAGUE",917,"PRAZSKY KRYSARIK"]
[null,"RETRIEVER A POIL BOUCLE",110,"CURLY COATED RETRIEVER"]
[null,"RETRIEVER A POIL PLAT",121,"FLAT COATED RETRIEVER"]
[null,"RETRIEVER DE LA BAIE DE CHESAPEAKE",263,"CHESAPEAKE BAY RETRIEVER"]
[null,"RETRIEVER DE LA NOUVELLE ECOSSE",312,"NOVA SCOTIA DUCK TOLLING RETRIEVER"]
[null,"RETRIEVER DU LABRADOR",122,"LABRADOR RETRIEVER"]
[null,"ROTTWEILER",147,"ROTTWEILER"]
[null,"SAINT BERNARD",61,"ST. BERNHARDSHUND"]
[null,"SALUKI",269,"SALUKI"]
[null,"SAMOYEDE",212,"SAMOIEDSKAÏA SABAKA"]
[null,"SCHAPENDOES NEERLANDAIS",313,"NEDERLANDSE SCHAPENDOES"]
[null,"SCHIPPERKE",83,"SCHIPPERKE"]
[null,"SCHNAUZER",182,"SCHNAUZER"]
[null,"SCHNAUZER GEANT",181,"RIESENSCHNAUZER"]
[null,"SCHNAUZER NAIN",183,"ZWERGSCHNAUZER"]
[null,"SEALYHAM TERRIER",74,"SEALYHAM TERRIER"]
[null,"SETTER ANGLAIS",2,"ENGLISH SETTER"]
[null,"SETTER GORDON",6,"GORDON SETTER"]
[null,"SETTER IRLANDAIS ROUGE",120,"IRISH RED SETTER"]
[null,"SETTER IRLANDAIS ROUGE & BLANC",330,"IRISH RED AND WHITE SETTER"]
[null,"SHAR PEI",309,"SHAR PEI"]
[null,"SHIBA",257,"SHIBA"]
[null,"SHIH TZU",208,"SHIH TZU"]
[null,"SHIKOKU",319,"SHIKOKU"]
[null,"SKYE TERRIER",75,"SKYE TERRIER"]
[null,"SLOUGHI",188,"SLOUGHI"]
[null,"SMOUS DES PAYS BAS",308,"HOLLANDSE SMOUSHOND"]
[null,"SPINONE",165,"SPINONE ITALIANO"]
[null,"SPITZ",97,""]
[null,"SPITZ DE NORRBOTTEN",276,"NORRBOTTENSPETS"]
[null,"SPITZ DES VISIGOTHS",14,"VÄSTGÖTASPETS"]
[null,"SPITZ FINLANDAIS",49,"SUOMENPYSTYKORVA - FINNISH SPITZ"]
[null,"SPITZ JAPONAIS",262,"NIHON SUPITTSU"]
[null,"STAFFORDSHIRE BULL TERRIER",76,"STAFFORDSHIRE BULL TERRIER"]
[null,"STAFFORDSHIRE TERRIER AMERICAIN",286,"AMERICAN STAFFORDSHIRE TERRIER"]
[null,"SUSSEX SPANIEL",127,"SUSSEX SPANIEL"]
[null,"TCHOUVATCH SLOVAQUE",142,"SLOVENSKY CUVAC"]
[null,"TECKEL",148,"DACHSHUND - TECKEL"]
[null,"TERRE NEUVE",50,"NEWFOUNDLAND"]
[null,"TERRIER AUSTRALIEN",8,"AUSTRALIAN TERRIER"]
[null,"TERRIER AUSTRALIEN A POIL SOYEUX",236,"AUSTRALIAN SILKY TERRIER"]
[null,"TERRIER BRESILIEN",341,"TERRIER BRASILEIRO"]
[null,"TERRIER D'AGREMENT ANGLAIS NOIR ET FEU",13,"ENGLISH TOY TERRIER BLACK AND TAN"]
[null,"TERRIER DE BOSTON",140,"BOSTON TERRIER"]
[null,"TERRIER DE CHASSE ALLEMAND",103,"DEUTSCHER JAGDTERRIER"]
[null,"TERRIER DU REVEREND RUSSELL",339,"PARSON RUSSELL TERRIER"]
[null,"TERRIER ECOSSAIS",73,"SCOTTISH TERRIER"]
[null,"TERRIER IRLANDAIS",139,"IRISH TERRIER"]
[null,"TERRIER IRLANDAIS A POIL DOUX",40,"IRISH SOFT COATED WHEATEN TERRIER"]
[null,"TERRIER IRLANDAIS GLEN OF IMAAL",302,"IRISH GLEN OF IMAAL TERRIER"]
[null,"TERRIER JACK RUSSELL",345,"JACK RUSSELL TERRIER"]
[null,"TERRIER JAPONAIS",259,"NIHON TERIA"]
[null,"TERRIER KERRY BLUE",3,"KERRY BLUE TERRIER"]
[null,"TERRIER NOIR RUSSE",327,"TCHIORNY TERRIER"]
[null,"TERRIER TCHEQUE",246,"CESKY TERRIER"]
[null,"TERRIER TIBETAIN",209,"TIBETAN TERRIER"]
[null,"TOSA",260,"TOSA"]
[null,"VOLPINO ITALIEN",195,"VOLPINO ITALIANO"]
[null,"WELSH CORGI CARDIGAN",38,"WELSH CORGI CARDIGAN"]
[null,"WELSH CORGI PEMBROKE",39,"WELSH CORGI PEMBROKE"]
[null,"WELSH SPRINGER SPANIEL",126,"WELSH SPRINGER SPANIEL"]
[null,"WELSH TERRIER",78,"WELSH TERRIER"]
[null,"WEST HIGHLAND WHITE TERRIER",85,"WEST HIGHLAND WHITE TERRIER"]
[null,"WHIPPET",162,"WHIPPET"]
[null,"YORKSHIRE TERRIER",86,"YORKSHIRE TERRIER"]

{"sheet":"SCC","index":4,"n_rows":19,"n_cols":15,"rows_kept":19,"cut":false,"hidden":true,"merged":[]}
["DATE","ORGANISATEUR","Code Race FCI","LO","NUMERO","IDENTIFIANT","RESULTAT","NIVEAU","qualificatif 1","qualificatif 2",null,null,null,null,"RESULTAT"]
[{"$f":"'Fiche organisateur N2'!$H$8","v":"00:00:00"},{"$f":"'Fiche organisateur N2'!$F$5","v":0},{"$f":"'Rapport de concours '!J17","v":0},{"$f":"'Rapport de concours '!P17","v":0},{"$f":"'Rapport de concours '!Q17","v":0},{"$f":"'Rapport de concours '!I17","v":0},{"$f":"'Rapport de concours '!O17","v":"-"},"TS3",{"$f":"'Rapport de concours '!L17","v":"-"},{"$f":"'Rapport de concours '!M17","v":"."},null,null,null,null,{"$f":"'Rapport de concours '!O17","v":"-"}]
[{"$f":"'Fiche organisateur N2'!$H$8","v":"00:00:00"},{"$f":"'Fiche organisateur N2'!$F$5","v":0},{"$f":"'Rapport de concours '!J18","v":0},{"$f":"'Rapport de concours '!P18","v":0},{"$f":"'Rapport de concours '!Q18","v":0},{"$f":"'Rapport de concours '!I18","v":0},{"$f":"'Rapport de concours '!O18","v":"-"},"TS3",{"$f":"'Rapport de concours '!L18","v":"-"},{"$f":"'Rapport de concours '!M18","v":"."},null,null,null,null,{"$f":"'Rapport de concours '!O18","v":"-"}]
[{"$f":"'Fiche organisateur N2'!$H$8","v":"00:00:00"},{"$f":"'Fiche organisateur N2'!$F$5","v":0},{"$f":"'Rapport de concours '!J19","v":0},{"$f":"'Rapport de concours '!P19","v":0},{"$f":"'Rapport de concours '!Q19","v":0},{"$f":"'Rapport de concours '!I19","v":0},{"$f":"'Rapport de concours '!O19","v":"-"},"TS3",{"$f":"'Rapport de concours '!L19","v":"-"},{"$f":"'Rapport de concours '!M19","v":"."},null,null,null,null,{"$f":"'Rapport de concours '!W19","v":0}]
[{"$f":"'Fiche organisateur N2'!$H$8","v":"00:00:00"},{"$f":"'Fiche organisateur N2'!$F$5","v":0},{"$f":"'Rapport de concours '!J20","v":0},{"$f":"'Rapport de concours '!P20","v":0},{"$f":"'Rapport de concours '!Q20","v":0},{"$f":"'Rapport de concours '!I20","v":0},{"$f":"'Rapport de concours '!O20","v":"-"},"TS3",{"$f":"'Rapport de concours '!L20","v":"-"},{"$f":"'Rapport de concours '!M20","v":"."},null,null,null,null,{"$f":"'Rapport de concours '!W20","v":0}]
[{"$f":"'Fiche organisateur N2'!$H$8","v":"00:00:00"},{"$f":"'Fiche organisateur N2'!$F$5","v":0},{"$f":"'Rapport de concours '!J21","v":0},{"$f":"'Rapport de concours '!P21","v":0},{"$f":"'Rapport de concours '!Q21","v":0},{"$f":"'Rapport de concours '!I21","v":0},{"$f":"'Rapport de concours '!O21","v":"-"},"TS3",{"$f":"'Rapport de concours '!L21","v":"-"},{"$f":"'Rapport de concours '!M21","v":"."},null,null,null,null,{"$f":"'Rapport de concours '!W21","v":0}]
[{"$f":"'Fiche organisateur N2'!$H$8","v":"00:00:00"},{"$f":"'Fiche organisateur N2'!$F$5","v":0},{"$f":"'Rapport de concours '!J22","v":0},{"$f":"'Rapport de concours '!P22","v":0},{"$f":"'Rapport de concours '!Q22","v":0},{"$f":"'Rapport de concours '!I22","v":0},{"$f":"'Rapport de concours '!O22","v":"-"},"TS3",{"$f":"'Rapport de concours '!L22","v":"-"},{"$f":"'Rapport de concours '!M22","v":"."},null,null,null,null,{"$f":"'Rapport de concours '!W22","v":0}]
[{"$f":"'Fiche organisateur N2'!$H$8","v":"00:00:00"},{"$f":"'Fiche organisateur N2'!$F$5","v":0},{"$f":"'Rapport de concours '!J23","v":0},{"$f":"'Rapport de concours '!P23","v":0},{"$f":"'Rapport de concours '!Q23","v":0},{"$f":"'Rapport de concours '!I23","v":0},{"$f":"'Rapport de concours '!O23","v":"-"},"TS3",{"$f":"'Rapport de concours '!L23","v":"-"},{"$f":"'Rapport de concours '!M23","v":"."},null,null,null,null,{"$f":"'Rapport de concours '!W23","v":0}]
[{"$f":"'Fiche organisateur N2'!$H$8","v":"00:00:00"},{"$f":"'Fiche organisateur N2'!$F$5","v":0},{"$f":"'Rapport de concours '!J24","v":0},{"$f":"'Rapport de concours '!P24","v":0},{"$f":"'Rapport de concours '!Q24","v":0},{"$f":"'Rapport de concours '!I24","v":0},{"$f":"'Rapport de concours '!O24","v":"-"},"TS3",{"$f":"'Rapport de concours '!L24","v":"-"},{"$f":"'Rapport de concours '!M24","v":"."},null,null,null,null,{"$f":"'Rapport de concours '!W24","v":0}]
[{"$f":"'Fiche organisateur N2'!$H$8","v":"00:00:00"},{"$f":"'Fiche organisateur N2'!$F$5","v":0},{"$f":"'Rapport de concours '!J25","v":0},{"$f":"'Rapport de concours '!P25","v":0},{"$f":"'Rapport de concours '!Q25","v":0},{"$f":"'Rapport de concours '!I25","v":0},{"$f":"'Rapport de concours '!O25","v":"-"},"TS3",{"$f":"'Rapport de concours '!L25","v":"-"},{"$f":"'Rapport de concours '!M25","v":"."},null,null,null,null,{"$f":"'Rapport de concours '!W25","v":0}]
[{"$f":"'Fiche organisateur N2'!$H$8","v":"00:00:00"},{"$f":"'Fiche organisateur N2'!$F$5","v":0},{"$f":"'Rapport de concours '!J26","v":0},{"$f":"'Rapport de concours '!P26","v":0},{"$f":"'Rapport de concours '!Q26","v":0},{"$f":"'Rapport de concours '!I26","v":0},{"$f":"'Rapport de concours '!O26","v":"-"},"TS3",{"$f":"'Rapport de concours '!L26","v":"-"},{"$f":"'Rapport de concours '!M26","v":"."},null,null,null,null,{"$f":"'Rapport de concours '!W26","v":0}]
[{"$f":"'Fiche organisateur N2'!$H$8","v":"00:00:00"},{"$f":"'Fiche organisateur N2'!$F$5","v":0},{"$f":"'Rapport de concours '!J27","v":0},{"$f":"'Rapport de concours '!P27","v":0},{"$f":"'Rapport de concours '!Q27","v":0},{"$f":"'Rapport de concours '!I27","v":0},{"$f":"'Rapport de concours '!O27","v":"-"},"TS3",{"$f":"'Rapport de concours '!L27","v":"-"},{"$f":"'Rapport de concours '!M27","v":"."},null,null,null,null,{"$f":"'Rapport de concours '!W27","v":0}]
[{"$f":"'Fiche organisateur N2'!$H$8","v":"00:00:00"},{"$f":"'Fiche organisateur N2'!$F$5","v":0},{"$f":"'Rapport de concours '!J28","v":0},{"$f":"'Rapport de concours '!P28","v":0},{"$f":"'Rapport de concours '!Q28","v":0},{"$f":"'Rapport de concours '!I28","v":0},{"$f":"'Rapport de concours '!O28","v":"-"},"TS3",{"$f":"'Rapport de concours '!L28","v":"-"},{"$f":"'Rapport de concours '!M28","v":"."},null,null,null,null,{"$f":"'Rapport de concours '!W28","v":0}]
[{"$f":"'Fiche organisateur N2'!$H$8","v":"00:00:00"},{"$f":"'Fiche organisateur N2'!$F$5","v":0},{"$f":"'Rapport de concours '!J29","v":0},{"$f":"'Rapport de concours '!P29","v":0},{"$f":"'Rapport de concours '!Q29","v":0},{"$f":"'Rapport de concours '!I29","v":0},{"$f":"'Rapport de concours '!O29","v":"-"},"TS3",{"$f":"'Rapport de concours '!L29","v":"-"},{"$f":"'Rapport de concours '!M29","v":"."},null,null,null,null,{"$f":"'Rapport de concours '!W29","v":0}]
[{"$f":"'Fiche organisateur N2'!$H$8","v":"00:00:00"},{"$f":"'Fiche organisateur N2'!$F$5","v":0},{"$f":"'Rapport de concours '!J30","v":0},{"$f":"'Rapport de concours '!P30","v":0},{"$f":"'Rapport de concours '!Q30","v":0},{"$f":"'Rapport de concours '!I30","v":0},{"$f":"'Rapport de concours '!O30","v":"-"},"TS3",{"$f":"'Rapport de concours '!L30","v":"-"},{"$f":"'Rapport de concours '!M30","v":"."},null,null,null,null,{"$f":"'Rapport de concours '!W30","v":0}]
[{"$f":"'Fiche organisateur N2'!$H$8","v":"00:00:00"},{"$f":"'Fiche organisateur N2'!$F$5","v":0},{"$f":"'Rapport de concours '!J31","v":0},{"$f":"'Rapport de concours '!P31","v":0},{"$f":"'Rapport de concours '!Q31","v":0},{"$f":"'Rapport de concours '!I31","v":0},{"$f":"'Rapport de concours '!O31","v":"-"},"TS3",{"$f":"'Rapport de concours '!L31","v":"-"},{"$f":"'Rapport de concours '!M31","v":"."},null,null,null,null,{"$f":"'Rapport de concours '!W31","v":0}]
[{"$f":"'Fiche organisateur N2'!$H$8","v":"00:00:00"},{"$f":"'Fiche organisateur N2'!$F$5","v":0},{"$f":"'Rapport de concours '!J32","v":0},{"$f":"'Rapport de concours '!P32","v":0},{"$f":"'Rapport de concours '!Q32","v":0},{"$f":"'Rapport de concours '!I32","v":0},{"$f":"'Rapport de concours '!O32","v":"-"},"TS3",{"$f":"'Rapport de concours '!L32","v":"-"},{"$f":"'Rapport de concours '!M32","v":"."},null,null,null,null,{"$f":"'Rapport de concours '!W32","v":0}]
[{"$f":"'Fiche organisateur N2'!$H$8","v":"00:00:00"},{"$f":"'Fiche organisateur N2'!$F$5","v":0},{"$f":"'Rapport de concours '!J33","v":0},{"$f":"'Rapport de concours '!P33","v":0},{"$f":"'Rapport de concours '!Q33","v":0},{"$f":"'Rapport de concours '!I33","v":0},{"$f":"'Rapport de concours '!O33","v":"-"},"TS3",{"$f":"'Rapport de concours '!L33","v":"-"},{"$f":"'Rapport de concours '!M33","v":"."},null,null,null,null,{"$f":"'Rapport de concours '!W33","v":0}]
[{"$f":"'Fiche organisateur N2'!$H$8","v":"00:00:00"},{"$f":"'Fiche organisateur N2'!$F$5","v":0},{"$f":"'Rapport de concours '!J34","v":0},{"$f":"'Rapport de concours '!P34","v":0},{"$f":"'Rapport de concours '!Q34","v":0},{"$f":"'Rapport de concours '!I34","v":0},{"$f":"'Rapport de concours '!O34","v":"-"},"TS3",{"$f":"'Rapport de concours '!L34","v":"-"},{"$f":"'Rapport de concours '!M34","v":"."},null,null,null,null,{"$f":"'Rapport de concours '!W34","v":0}]

{"sheet":"00","index":5,"n_rows":60,"n_cols":28,"rows_kept":60,"cut":false,"hidden":false,"merged":[[55,18,55,19],[17,17,17,19],[44,18,44,19],[45,18,45,19],[46,18,46,19],[47,18,47,19],[48,18,48,19],[49,18,49,19],[50,18,50,19],[51,18,51,19],[52,18,52,19],[53,18,53,19],[54,18,54,19],[2,1,2,10],[13,0,13,1],[37,1,37,2],[38,1,38,2],[38,3,38,11],[37,5,37,7],[37,3,37,4],[6,3,6,4],[13,8,13,9],[14,8,14,9],[15,8,15,9],[16,8,16,9],[17,8,17,9],[23,8,23,9],[24,8,24,9],[35,10,35,11],[15,6,15,7],[16,6,16,7],[17,6,17,7],[23,6,23,7],[24,6,24,7],[25,6,25,7],[31,8,31,9],[32,8,32,9],[26,6,26,7],[27,6,27,7],[33,10,33,11],[34,10,34,11],[33,8,33,9],[34,8,34,9],[34,6,34,7],[4,6,4,8],[25,8,25,9],[26,8,26,9],[27,8,27,9],[28,8,28,9],[29,8,29,9],[28,6,28,7],[29,6,29,7],[30,6,30,7],[31,6,31,7],[24,10,24,11],[25,10,25,11],[26,10,26,11],[27,10,27,11],[28,10,28,11],[29,10,29,11],[21,10,21,11],[25,4,25,5],[26,4,26,5],[27,4,27,5],[28,4,28,5],[29,4,29,5],[23,4,23,5],[24,4,24,5],[21,4,21,5],[22,4,22,5],[35,4,35,5],[35,8,35,9],[37,8,37,10],[39,1,39,11],[35,6,35,7],[36,1,36,2],[36,4,36,7],[36,8,36,11],[30,4,30,5],[30,10,30,11],[34,4,34,5],[31,10,31,11],[30,8,30,9],[33,6,33,7],[32,10,32,11],[31,4,31,5],[32,4,32,5],[33,4,33,5],[32,6,32,7],[22,10,22,11],[23,10,23,11],[21,6,21,7],[22,6,22,7],[21,8,21,9],[22,8,22,9],[15,10,15,11],[16,10,16,11],[17,10,17,11],[18,10,18,11],[19,10,19,11],[20,10,20,11],[18,6,18,7],[19,6,19,7],[15,17,15,19],[16,17,16,19],[11,1,12,1],[18,4,18,5],[19,4,19,5],[20,4,20,5],[13,2,13,3],[13,10,13,11],[14,4,14,5],[14,6,14,7],[14,10,14,11],[19,8,19,9],[20,8,20,9],[15,4,15,5],[16,4,16,5],[17,4,17,5],[20,6,20,7],[18,8,18,9],[13,4,13,5],[13,6,13,7]]}
[null,null,null,null,null,null,"IHT TS",{"$f":"'Fiche organisateur N1'!$E$26","v":"HWT"}]
[]
[]
[]
[null,null,null,null,null,null,"COUNTRY LOGO"]
["Organisation ",{"$f":"'Fiche organisateur N2'!F5","v":0}]
["PLACE",{"$f":"'Fiche organisateur N2'!F6","v":0},"Date : ",{"$f":"'Fiche organisateur N2'!$H$8","v":0}]
["Contact : ",0]
[]
[null,0,null,null,0]
[null,"Feuille de Préparation ",null,null,0]
[null,"A remplir avec le juge ",null,null,0]
[null,null,null,null,0]
["for the country--->",null,null,null,null,null,null,null,null,null,null,null,null,null,null,null,null,null,null,null,null,null,null,null,null,"IHT1","IHT2","IHT3"]
["EXERCISES ","OBSERVATIONS","Mini","SCORE","Control of the flock",null,"MOVING",null,"DIFFICULT PASSAGES",null,"BEHAVIOUR",null,null,null,null,null,null,null,null,null,null,null,null,null,null,35,35,40]
[null,null,null,{"$f":"IF(COUNT(E16:L16)=0,\"-\",E16+G16+I16+K16-C16)","v":"-"},null,null,null,null,null,null,null,null,null,null,null,null,null,"Exercices ",null,null,"HWT"]
[null,null,null,{"$f":"IF(COUNT(E17:L17)=0,\"-\",E17+G17+I17+K17-C17)","v":"-"},null,null,null,null,null,null,null,null,null,null,null,null,null,"GUARDING",null,null,50]
[null,null,null,"-",null,null,null,null,null,null,null,null,null,null,null,null,null,"Pen / Sortie du parc",null,null,10]
[null,null,null,"-",null,null,null,null,null,null,null,null,null,null,null,null,null,"Stop",null,null,15,null,null,null,null,45,55,70]
[null,null,null,"-",null,null,null,null,null,null,null,null,null,null,null,null,null,"Graze / Pâturage",null,null,15]
[null,null,null,"-",null,null,null,null,null,null,null,null,null,null,null,null,null,"Re-pen / Rentrée au parc",null,null,10]
[null,null,null,"-",null,null,null,null,null,null,null,null,null,null,null,null,null,"Moving / Conduite du troupeau",null,null,30]
[null,null,null,"-",null,null,null,null,null,null,null,null,null,null,null,null,null,"Behaviour / Comportement",null,null,20]
[null,null,null,"-",null,null,null,null,null,null,null,null,null,null,null,null,null,"Aptitude naturelle / Natural ability "]
[null,null,null,"-",null,null,null,null,null,null,null,null,null,null,null,null,null,"Absence d’agressivité/ gentleness "]
[null,null,null,"-",null,null,null,null,null,null,null,null,null,null,null,null,null,"Intelligence d’exécution/ Intelligence of execution  "]
[null,null,null,"-",null,null,null,null,null,null,null,null,null,null,null,null,null,"Obéissance / Obedience "]
[null,null,null,"-",null,null,null,null,null,null,null,null,null,null,null,null,null,null,null,null,100]
[null,null,null,"-"]
[null,null,null,"-"]
[null,null,null,"-"]
["Aptitude naturelle",null,null,"-"]
["Gentillesse",null,null,"-"]
["Intelligence de l'execution",null,null,"-"]
["Obéissance",null,null,"-"]
["POINTS TOTAL",null,null,{"$f":"SUM(D16:D35)","v":0},50,{"$f":"IF(J10=1,AI50,IF(J10=2,AI54,AI58))","v":0},30,{"$f":"IF(L10=1,W51,IF(L10=2,W55,W59))","v":0.1},0,{"$f":"IF(N10=1,#REF!,IF(N10=2,#REF!,#REF!))","v":{"$error":"#REF!"}},20,{"$f":"IF(P10=1,#REF!,IF(P10=2,#REF!,#REF!))","v":{"$error":"#REF!"}}]
["Détails des pénéalités ",null,null,"0","Pénalités en Négatif"]
[" POINTS",{"$f":"IF((C36)=0,\"-\",D36+D37-C36)","v":"-"},{"$f":"IF(COUNT(D38:K38)=0,\"-\",D38+F38+H38+J38-B38)","v":"-"},"EVALUATION",null,{"$f":"$L$55","v":"-"},null,null,{"$f":"'Rapport de concours '!$N$17","v":"X"},null,null,0]
[null," - ",null,null,null,null,null,null,null,null,null,null,{"$f":"SUM(E16:E35)","v":0},{"$f":"SUM(G16:G35)","v":0},{"$f":"SUM(I16:I35)","v":0},{"$f":"SUM(K16:K35)","v":0},{"$f":"IF(E36=M39,\"OK\",\"CHECK POINTS\")","v":"CHECK POINTS"},{"$f":"IF(G36=N39,\"OK\",\"CHECK POINTS\")","v":"CHECK POINTS"},{"$f":"IF(I36=O39,\"OK\",\"CHECK POINTS\")","v":"OK"},{"$f":"IF(K36=P39,\"OK\",\"CHECK POINTS\")","v":"CHECK POINTS"}]
["Observations :  ",null,null,null,null,null,null,null,null,null,null,null,null,null,null,null,{"$f":"SUM(E16:F31)","v":0},{"$f":"SUM(G16:H31)","v":0},{"$f":"SUM(I16:J31)","v":0},{"$f":"SUM(K32:L35)","v":0},"TOTAL PAR LIGNE "]
[]
[]
[]
[]
[null,null,null,null,null,null,null,null,null,null,null,null,null,null,null,null,48,"IHT1","GUARDING",null,35]
[null,null,null,null,null,null,null,null,null,null,null,null,null,null,null,null,49,"IHT1","MOVING",null,45]
[null,null,null,null,null,null,null,null,null,null,null,null,null,null,null,null,50,"IHT1","DIFFICULT PASS",null,10]
[null,null,null,null,null,null,null,null,null,null,null,null,null,null,null,null,51,"IHT1","BEHAVIOUR",null,10]
[null,null,null,null,null,null,null,null,null,null,null,null,null,null,null,null,52,"IHT2","GUARDING",null,35]
[null,null,null,null,null,null,null,null,null,null,null,null,null,null,null,null,53,"IHT2","MOVING",null,55]
[null,null,null,null,null,null,null,null,null,null,null,null,null,null,null,null,54,"IHT2","DIFFICULT PASS",null,20]
[null,null,null,null,null,null,null,null,null,null,null,null,null,null,null,null,55,"IHT2","BEHAVIOUR",null,10]
[null,null,null,null,null,null,null,null,null,null,null,null,null,null,null,null,56,"IHT3","GUARDING",null,40]
[null,null,null,null,null,null,null,null,null,null,null,null,null,null,null,null,57,"IHT3","MOVING",null,70]
[null,null,null,null,null,null,null,null,null,null,null,{"$f":"IF(B38=\"-\",\"-\",IF(B38>S58,\"EXCELLENT\",IF(B38>T58,\"TRES BON\",IF(B38>U58,\"BON\",IF(B38>V58,\"insuffisant\",IF(B37>0.1,\"insuffisant \",\"éliminé \"))))))","v":"-"},null,null,null,null,58,"IHT3","DIFFICULT PASS",null,30]
[null,null,null,null,null,null,null,null,null,null,null,null,null,null,null,null,59,"IHT3","BEHAVIOUR",null,10]
[]
[null,null,null,null,null,null,null,null,null,null,null,null,null,null,null,null,"IHT1",100,{"$f":"R58*89.999/100","v":89.998999999999995},{"$f":"R58*79.999/100","v":79.998999999999995},{"$f":"R58*69.999/100","v":69.998999999999995},{"$f":"R58*59.999/100","v":59.999000000000002},0.1]
[null,null,null,null,null,null,null,null,null,null,null,null,null,null,null,null,"iIHT2",120,{"$f":"R59*89.999/100","v":107.99879999999999},{"$f":"R59*79.999/100","v":95.998799999999989},{"$f":"R59*69.999/100","v":83.998799999999989},{"$f":"R59*59.999/100","v":71.998800000000003},0.1]
[null,null,null,null,null,null,null,null,null,null,null,null,null,null,null,null,"IHT3",150,134.99849999999998,{"$f":"R60*79.999/100","v":119.99849999999998},{"$f":"R60*69.999/100","v":104.99849999999998},{"$f":"R60*59.999/100","v":89.998500000000007},0.1]

{"sheet":"01","index":6,"n_rows":60,"n_cols":23,"rows_kept":60,"cut":false,"hidden":false,"merged":[[53,18,53,19],[37,5,37,7],[37,3,37,4],[44,18,44,19],[45,18,45,19],[46,18,46,19],[47,18,47,19],[48,18,48,19],[49,18,49,19],[50,18,50,19],[51,18,51,19],[52,18,52,19],[39,1,39,11],[35,8,35,9],[36,1,36,2],[37,1,37,2],[17,4,17,5],[19,4,19,5],[19,6,19,7],[19,8,19,9],[19,10,19,11],[20,4,20,5],[20,6,20,7],[20,8,20,9],[20,10,20,11],[17,6,17,7],[17,8,17,9],[17,10,17,11],[18,4,18,5],[18,6,18,7],[18,8,18,9],[18,10,18,11],[23,4,23,5],[23,6,23,7],[23,8,23,9],[23,10,23,11],[24,4,24,5],[26,4,26,5],[26,6,26,7],[26,8,26,9],[26,10,26,11],[24,6,24,7],[24,8,24,9],[24,10,24,11],[21,4,21,5],[21,6,21,7],[21,8,21,9],[21,10,21,11],[22,4,22,5],[22,6,22,7],[22,8,22,9],[22,10,22,11],[32,8,32,9],[32,10,32,11],[29,4,29,5],[29,6,29,7],[29,8,29,9],[29,10,29,11],[30,4,30,5],[30,6,30,7],[30,8,30,9],[30,10,30,11],[14,10,14,11],[15,4,15,5],[15,6,15,7],[15,8,15,9],[15,10,15,11],[14,4,14,5],[14,6,14,7],[14,8,14,9],[31,4,31,5],[31,6,31,7],[31,8,31,9],[31,10,31,11],[27,4,27,5],[27,6,27,7],[27,8,27,9],[27,10,27,11],[28,4,28,5],[28,6,28,7],[28,8,28,9],[28,10,28,11],[25,4,25,5],[25,6,25,7],[25,8,25,9],[25,10,25,11],[2,1,2,10],[4,6,4,8],[13,0,13,1],[13,2,13,3],[13,4,13,5],[13,6,13,7],[13,8,13,9],[13,10,13,11],[8,2,8,3],[9,2,9,3],[10,2,10,3],[11,2,11,3],[6,2,6,3],[7,4,7,10],[8,4,8,10],[9,4,9,10],[10,4,10,10],[11,4,11,10],[12,4,12,10],[6,4,6,10],[54,18,54,19],[55,18,55,19],[38,1,38,2],[16,4,16,5],[16,6,16,7],[16,8,16,9],[16,10,16,11],[36,4,36,7],[36,8,36,11],[37,8,37,10],[35,4,35,5],[35,6,35,7],[35,10,35,11],[38,3,38,11],[33,4,33,5],[33,6,33,7],[33,8,33,9],[33,10,33,11],[34,4,34,5],[34,6,34,7],[34,8,34,9],[34,10,34,11],[32,4,32,5],[32,6,32,7]]}
[null,null,null,null,null,null,"IHT TS","HWT"]
[]
[]
[]
[null,"IHT TS ",null,null,null,null,"COUNTRY LOGO"]
["Organisation",{"$f":"'Fiche organisateur N2'!F5","v":0}]
["Ville",{"$f":"'Fiche organisateur N2'!F6","v":0},"Date : ",null,{"$f":"'Fiche organisateur N2'!$H$8","v":0}]
["Contact : ",0]
["Propriètaire",{"$f":"'Fiche organisateur N2'!$C$17","v":0},"Race et sexe",null,{"$f":"'Fiche organisateur N2'!$G$17","v":0}]
["Conducteur",{"$f":"'Fiche organisateur N2'!$D$17","v":0},"Né",null,{"$f":"'Fiche organisateur N2'!$K$17","v":0}]
["Nom du chien",{"$f":"'Fiche organisateur N2'!$E$17","v":0},"PEDIGREE",null,{"$f":"'Fiche organisateur N2'!$J$17","v":0}]
["Affixe",{"$f":"'Fiche organisateur N2'!$F$17","v":0},"Identifiant ",null,{"$f":"'Fiche organisateur N2'!$L$17","v":0}]
[]
["for the country--->",null,null,null,{"$f":"'00'!E14","v":0},null,{"$f":"'00'!G14","v":0},null,{"$f":"'00'!I14","v":0},null,{"$f":"'00'!K14","v":0}]
["EXERCISES ","OBSERVATIONS","Mini","SCORE",{"$f":"'00'!E15","v":"Control of the flock"},null,{"$f":"'00'!G15","v":"MOVING"},null,{"$f":"'00'!I15","v":"DIFFICULT PASSAGES"},null,{"$f":"'00'!K15","v":"BEHAVIOUR"}]
[{"$f":"'00'!A16","v":0},null,null,{"$f":"IF(COUNT(E16:L16)=0,\"-\",E16+G16+I16+K16-C16)","v":0},{"$f":"'00'!E16","v":0},null,{"$f":"'00'!G16","v":0},null,{"$f":"'00'!I16","v":0},null,{"$f":"'00'!K16","v":0}]
[0,null,null,0,{"$f":"'00'!E17","v":0},null,{"$f":"'00'!G17","v":0},null,{"$f":"'00'!I17","v":0},null,{"$f":"'00'!K17","v":0}]
[{"$f":"'00'!A18","v":0},null,null,0,{"$f":"'00'!E18","v":0},null,{"$f":"'00'!G18","v":0},null,{"$f":"'00'!I18","v":0},null,{"$f":"'00'!K18","v":0}]
[{"$f":"'00'!A19","v":0},null,null,0,{"$f":"'00'!E19","v":0},null,{"$f":"'00'!G19","v":0},null,{"$f":"'00'!I19","v":0},null,{"$f":"'00'!K19","v":0}]
[{"$f":"'00'!A20","v":0},null,null,0,{"$f":"'00'!E20","v":0},null,{"$f":"'00'!G20","v":0},null,{"$f":"'00'!I20","v":0},null,{"$f":"'00'!K20","v":0}]
[{"$f":"'00'!A21","v":0},null,null,0,{"$f":"'00'!E21","v":0},null,{"$f":"'00'!G21","v":0},null,{"$f":"'00'!I21","v":0},null,{"$f":"'00'!K21","v":0}]
[{"$f":"'00'!A22","v":0},null,null,0,{"$f":"'00'!E22","v":0},null,{"$f":"'00'!G22","v":0},null,{"$f":"'00'!I22","v":0},null,{"$f":"'00'!K22","v":0}]
[{"$f":"'00'!A23","v":0},null,null,0,{"$f":"'00'!E23","v":0},null,{"$f":"'00'!G23","v":0},null,{"$f":"'00'!I23","v":0},null,{"$f":"'00'!K23","v":0}]
[{"$f":"'00'!A24","v":0},null,null,0,{"$f":"'00'!E24","v":0},null,{"$f":"'00'!G24","v":0},null,{"$f":"'00'!I24","v":0},null,{"$f":"'00'!K24","v":0}]
[{"$f":"'00'!A25","v":0},null,null,0,{"$f":"'00'!E25","v":0},null,{"$f":"'00'!G25","v":0},null,{"$f":"'00'!I25","v":0},null,{"$f":"'00'!K25","v":0}]
[{"$f":"'00'!A26","v":0},null,null,0,{"$f":"'00'!E26","v":0},null,{"$f":"'00'!G26","v":0},null,{"$f":"'00'!I26","v":0},null,{"$f":"'00'!K26","v":0}]
[{"$f":"'00'!A27","v":0},null,null,0,{"$f":"'00'!E27","v":0},null,{"$f":"'00'!G27","v":0},null,{"$f":"'00'!I27","v":0},null,{"$f":"'00'!K27","v":0}]
[{"$f":"'00'!A28","v":0},null,null,0,{"$f":"'00'!E28","v":0},null,{"$f":"'00'!G28","v":0},null,{"$f":"'00'!I28","v":0},null,{"$f":"'00'!K28","v":0}]
[{"$f":"'00'!A29","v":0},null,null,0,{"$f":"'00'!E29","v":0},null,{"$f":"'00'!G29","v":0},null,{"$f":"'00'!I29","v":0},null,{"$f":"'00'!K29","v":0}]
[{"$f":"'00'!A30","v":0},null,null,0,{"$f":"'00'!E30","v":0},null,{"$f":"'00'!G30","v":0},null,{"$f":"'00'!I30","v":0},null,{"$f":"'00'!K30","v":0}]
[{"$f":"'00'!A31","v":0},null,null,0,{"$f":"'00'!E31","v":0},null,{"$f":"'00'!G31","v":0},null,{"$f":"'00'!I31","v":0},null,{"$f":"'00'!K31","v":0}]
[{"$f":"'00'!A32","v":"Aptitude naturelle"},null,null,0,{"$f":"'00'!E32","v":0},null,{"$f":"'00'!G32","v":0},null,{"$f":"'00'!I32","v":0},null,{"$f":"'00'!K32","v":0}]
[{"$f":"'00'!A33","v":"Gentillesse"},null,null,0,{"$f":"'00'!E33","v":0},null,{"$f":"'00'!G33","v":0},null,{"$f":"'00'!I33","v":0},null,{"$f":"'00'!K33","v":0}]
[{"$f":"'00'!A34","v":"Intelligence de l'execution"},null,null,0,{"$f":"'00'!E34","v":0},null,{"$f":"'00'!G34","v":0},null,{"$f":"'00'!I34","v":0},null,{"$f":"'00'!K34","v":0}]
[{"$f":"'00'!A35","v":"Obéissance"},null,null,0,{"$f":"'00'!E35","v":0},null,{"$f":"'00'!G35","v":0},null,{"$f":"'00'!I35","v":0},null,{"$f":"'00'!K35","v":0}]
["POINTS TOTAL",null,{"$f":"SUM(C16:C35)","v":0},{"$f":"SUM(D16:D35)","v":0},{"$f":"'00'!E36","v":50},null,{"$f":"'00'!G36","v":30},null,{"$f":"'00'!I36","v":0},null,{"$f":"'00'!K36","v":20}]
["Détails des pénéalités ",null,null,"0","Pénalités en Négatif",null,null,null,"Classement"]
[" POINTS",{"$f":"IF((C36)=0,\"-\",D36+D37)","v":"-"},{"$f":"IF(COUNT(D38:K38)=0,\"-\",D38+F38+H38+J38-B38)","v":"-"},"EVALUATION",null,{"$f":"$L$55","v":"-"},null,null,{"$f":"'Rapport de concours '!N17","v":"X"},null,null,{"$f":"COUNT(S17:S34)","v":0}]
[null,"."]
["Observations :  ",null,null,null,null,null,null,null,null,null,null,null,null,null,null,null,0]
[]
[]
[]
[]
[null,null,null,null,null,null,null,null,null,null,null,null,null,null,null,null,48,"IHT1","GUARDING",null,35]
[null,null,null,null,null,null,null,null,null,null,null,null,null,null,null,null,49,"IHT1","MOVING",null,45]
[null,null,null,null,null,null,null,null,null,null,null,null,null,null,null,null,50,"IHT1","DIFFICULT PASS",null,10]
[null,null,null,null,null,null,null,null,null,null,null,null,null,null,null,null,51,"IHT1","BEHAVIOUR",null,10]
[null,null,null,null,null,null,null,null,null,null,null,null,null,null,null,null,52,"IHT2","GUARDING",null,35]
[null,null,null,null,null,null,null,null,null,null,null,null,null,null,null,null,53,"IHT2","MOVING",null,55]
[null,null,null,null,null,null,null,null,null,null,null,null,null,null,null,null,54,"IHT2","DIFFICULT PASS",null,20]
[null,null,null,null,null,null,null,null,null,null,null,null,null,null,null,null,55,"IHT2","BEHAVIOUR",null,10]
[null,null,null,null,null,null,null,null,null,null,null,null,null,null,null,null,56,"IHT3","GUARDING",null,40]
[null,null,null,null,null,null,null,null,null,null,null,null,null,null,null,null,57,"IHT3","MOVING",null,70]
[null,null,null,null,null,null,null,null,null,null,null,{"$f":"IF(B38=\"-\",\"-\",IF(B38>S58,\"EXCELLENT\",IF(B38>T58,\"TRES BON\",IF(B38>U58,\"BON\",IF(B38>V58,\"insuffisant\",IF(B37>0.1,\"insuffisant \",\"éliminé \"))))))","v":"-"},null,null,null,null,58,"IHT3","DIFFICULT PASS",null,30]
[null,null,null,null,null,null,null,null,null,null,null,null,null,null,null,null,59,"IHT3","BEHAVIOUR",null,10]
[]
[null,null,null,null,null,null,null,null,null,null,null,null,null,null,null,null,"IHT1",100,{"$f":"R58*89.999/100","v":89.998999999999995},{"$f":"R58*79.999/100","v":79.998999999999995},{"$f":"R58*69.999/100","v":69.998999999999995},{"$f":"R58*59.999/100","v":59.999000000000002},0.1]
[null,null,null,null,null,null,null,null,null,null,null,null,null,null,null,null,"iIHT2",120,{"$f":"R59*89.999/100","v":107.99879999999999},{"$f":"R59*79.999/100","v":95.998799999999989},{"$f":"R59*69.999/100","v":83.998799999999989},{"$f":"R59*59.999/100","v":71.998800000000003},0.1]
[null,null,null,null,null,null,null,null,null,null,null,null,null,null,null,null,"IHT3",150,134.99849999999998,{"$f":"R60*79.999/100","v":119.99849999999998},{"$f":"R60*69.999/100","v":104.99849999999998},{"$f":"R60*59.999/100","v":89.998500000000007},0.1]

{"sheet":"02","index":7,"n_rows":60,"n_cols":23,"rows_kept":60,"cut":false,"hidden":false,"merged":[[53,18,53,19],[54,18,54,19],[55,18,55,19],[47,18,47,19],[48,18,48,19],[49,18,49,19],[50,18,50,19],[51,18,51,19],[52,18,52,19],[38,1,38,2],[38,3,38,11],[39,1,39,11],[44,18,44,19],[45,18,45,19],[46,18,46,19],[36,1,36,2],[36,4,36,7],[36,8,36,11],[37,1,37,2],[37,3,37,4],[37,5,37,7],[37,8,37,10],[34,4,34,5],[34,6,34,7],[34,8,34,9],[34,10,34,11],[35,4,35,5],[35,6,35,7],[35,8,35,9],[35,10,35,11],[32,4,32,5],[32,6,32,7],[32,8,32,9],[32,10,32,11],[33,4,33,5],[33,6,33,7],[33,8,33,9],[33,10,33,11],[30,4,30,5],[30,6,30,7],[30,8,30,9],[30,10,30,11],[31,4,31,5],[31,6,31,7],[31,8,31,9],[31,10,31,11],[28,4,28,5],[28,6,28,7],[28,8,28,9],[28,10,28,11],[29,4,29,5],[29,6,29,7],[29,8,29,9],[29,10,29,11],[26,4,26,5],[26,6,26,7],[26,8,26,9],[26,10,26,11],[27,4,27,5],[27,6,27,7],[27,8,27,9],[27,10,27,11],[24,4,24,5],[24,6,24,7],[24,8,24,9],[24,10,24,11],[25,4,25,5],[25,6,25,7],[25,8,25,9],[25,10,25,11],[22,4,22,5],[22,6,22,7],[22,8,22,9],[22,10,22,11],[23,4,23,5],[23,6,23,7],[23,8,23,9],[23,10,23,11],[20,4,20,5],[20,6,20,7],[20,8,20,9],[20,10,20,11],[21,4,21,5],[21,6,21,7],[21,8,21,9],[21,10,21,11],[18,4,18,5],[18,6,18,7],[18,8,18,9],[18,10,18,11],[19,4,19,5],[19,6,19,7],[19,8,19,9],[19,10,19,11],[16,4,16,5],[16,6,16,7],[16,8,16,9],[16,10,16,11],[17,4,17,5],[17,6,17,7],[17,8,17,9],[17,10,17,11],[14,4,14,5],[14,6,14,7],[14,8,14,9],[14,10,14,11],[15,4,15,5],[15,6,15,7],[15,8,15,9],[15,10,15,11],[12,4,12,10],[2,1,2,10],[4,6,4,8],[6,2,6,3],[6,4,6,10],[7,4,7,10],[8,2,8,3],[8,4,8,10],[13,0,13,1],[13,2,13,3],[13,4,13,5],[13,6,13,7],[13,8,13,9],[13,10,13,11],[9,2,9,3],[9,4,9,10],[10,2,10,3],[10,4,10,10],[11,2,11,3],[11,4,11,10]]}
[null,null,null,null,null,null,"IHT TS","HWT"]
[]
[]
[]
[null,"IHT TS ",null,null,null,null,"COUNTRY LOGO"]
["Organisation",{"$f":"'Fiche organisateur N2'!F5","v":0}]
["Ville",{"$f":"'Fiche organisateur N2'!F6","v":0},"Date : ",null,{"$f":"'Fiche organisateur N2'!$H$8","v":0}]
["Contact : ",0]
["Propriètaire",{"$f":"'Fiche organisateur N2'!$C$18","v":0},"Race et sexe",null,{"$f":"'Fiche organisateur N2'!$G$18","v":0}]
["Conducteur",{"$f":"'Fiche organisateur N2'!$D$18","v":0},"Né",null,{"$f":"'Fiche organisateur N2'!$K$18","v":0}]
["Nom du chien",{"$f":"'Fiche organisateur N2'!$E$18","v":0},"PEDIGREE",null,{"$f":"'Fiche organisateur N2'!$J$18","v":0}]
["Affixe",{"$f":"'Fiche organisateur N2'!$F$18","v":0},"Identifiant ",null,{"$f":"'Fiche organisateur N2'!$L$18","v":0}]
[]
["for the country--->",null,null,null,{"$f":"'00'!E14","v":0},null,{"$f":"'00'!G14","v":0},null,{"$f":"'00'!I14","v":0},null,{"$f":"'00'!K14","v":0}]
["EXERCISES ","OBSERVATIONS","Mini","SCORE",{"$f":"'00'!E15","v":"Control of the flock"},null,{"$f":"'00'!G15","v":"MOVING"},null,{"$f":"'00'!I15","v":"DIFFICULT PASSAGES"},null,{"$f":"'00'!K15","v":"BEHAVIOUR"}]
[{"$f":"'00'!A16","v":0},null,null,{"$f":"IF(COUNT(E16:L16)=0,\"-\",E16+G16+I16+K16-C16)","v":0},{"$f":"'00'!E16","v":0},null,{"$f":"'00'!G16","v":0},null,{"$f":"'00'!I16","v":0},null,{"$f":"'00'!K16","v":0}]
[0,null,null,0,{"$f":"'00'!E17","v":0},null,{"$f":"'00'!G17","v":0},null,{"$f":"'00'!I17","v":0},null,{"$f":"'00'!K17","v":0}]
[{"$f":"'00'!A18","v":0},null,null,0,{"$f":"'00'!E18","v":0},null,{"$f":"'00'!G18","v":0},null,{"$f":"'00'!I18","v":0},null,{"$f":"'00'!K18","v":0}]
[{"$f":"'00'!A19","v":0},null,null,0,{"$f":"'00'!E19","v":0},null,{"$f":"'00'!G19","v":0},null,{"$f":"'00'!I19","v":0},null,{"$f":"'00'!K19","v":0}]
[{"$f":"'00'!A20","v":0},null,null,0,{"$f":"'00'!E20","v":0},null,{"$f":"'00'!G20","v":0},null,{"$f":"'00'!I20","v":0},null,{"$f":"'00'!K20","v":0}]
[{"$f":"'00'!A21","v":0},null,null,0,{"$f":"'00'!E21","v":0},null,{"$f":"'00'!G21","v":0},null,{"$f":"'00'!I21","v":0},null,{"$f":"'00'!K21","v":0}]
[{"$f":"'00'!A22","v":0},null,null,0,{"$f":"'00'!E22","v":0},null,{"$f":"'00'!G22","v":0},null,{"$f":"'00'!I22","v":0},null,{"$f":"'00'!K22","v":0}]
[{"$f":"'00'!A23","v":0},null,null,0,{"$f":"'00'!E23","v":0},null,{"$f":"'00'!G23","v":0},null,{"$f":"'00'!I23","v":0},null,{"$f":"'00'!K23","v":0}]
[{"$f":"'00'!A24","v":0},null,null,0,{"$f":"'00'!E24","v":0},null,{"$f":"'00'!G24","v":0},null,{"$f":"'00'!I24","v":0},null,{"$f":"'00'!K24","v":0}]
[{"$f":"'00'!A25","v":0},null,null,0,{"$f":"'00'!E25","v":0},null,{"$f":"'00'!G25","v":0},null,{"$f":"'00'!I25","v":0},null,{"$f":"'00'!K25","v":0}]
[{"$f":"'00'!A26","v":0},null,null,0,{"$f":"'00'!E26","v":0},null,{"$f":"'00'!G26","v":0},null,{"$f":"'00'!I26","v":0},null,{"$f":"'00'!K26","v":0}]
[{"$f":"'00'!A27","v":0},null,null,0,{"$f":"'00'!E27","v":0},null,{"$f":"'00'!G27","v":0},null,{"$f":"'00'!I27","v":0},null,{"$f":"'00'!K27","v":0}]
[{"$f":"'00'!A28","v":0},null,null,0,{"$f":"'00'!E28","v":0},null,{"$f":"'00'!G28","v":0},null,{"$f":"'00'!I28","v":0},null,{"$f":"'00'!K28","v":0}]
[{"$f":"'00'!A29","v":0},null,null,0,{"$f":"'00'!E29","v":0},null,{"$f":"'00'!G29","v":0},null,{"$f":"'00'!I29","v":0},null,{"$f":"'00'!K29","v":0}]
[{"$f":"'00'!A30","v":0},null,null,0,{"$f":"'00'!E30","v":0},null,{"$f":"'00'!G30","v":0},null,{"$f":"'00'!I30","v":0},null,{"$f":"'00'!K30","v":0}]
[{"$f":"'00'!A31","v":0},null,null,0,{"$f":"'00'!E31","v":0},null,{"$f":"'00'!G31","v":0},null,{"$f":"'00'!I31","v":0},null,{"$f":"'00'!K31","v":0}]
[{"$f":"'00'!A32","v":"Aptitude naturelle"},null,null,0,{"$f":"'00'!E32","v":0},null,{"$f":"'00'!G32","v":0},null,{"$f":"'00'!I32","v":0},null,{"$f":"'00'!K32","v":0}]
[{"$f":"'00'!A33","v":"Gentillesse"},null,null,0,{"$f":"'00'!E33","v":0},null,{"$f":"'00'!G33","v":0},null,{"$f":"'00'!I33","v":0},null,{"$f":"'00'!K33","v":0}]
[{"$f":"'00'!A34","v":"Intelligence de l'execution"},null,null,0,{"$f":"'00'!E34","v":0},null,{"$f":"'00'!G34","v":0},null,{"$f":"'00'!I34","v":0},null,{"$f":"'00'!K34","v":0}]
[{"$f":"'00'!A35","v":"Obéissance"},null,null,0,{"$f":"'00'!E35","v":0},null,{"$f":"'00'!G35","v":0},null,{"$f":"'00'!I35","v":0},null,{"$f":"'00'!K35","v":0}]
["POINTS TOTAL",null,{"$f":"SUM(C16:C35)","v":0},{"$f":"SUM(D16:D35)","v":0},{"$f":"'00'!E36","v":50},null,{"$f":"'00'!G36","v":30},null,{"$f":"'00'!I36","v":0},null,{"$f":"'00'!K36","v":20}]
["Détails des pénéalités ",null,null,"0","Pénalités en Négatif",null,null,null,"RANKING"]
[" POINTS",{"$f":"IF((C36)=0,\"-\",D36+D37)","v":"-"},{"$f":"IF(COUNT(D38:K38)=0,\"-\",D38+F38+H38+J38-B38)","v":"-"},"EVALUATION",null,{"$f":"$L$55","v":"-"},null,null,{"$f":"'Rapport de concours '!N18","v":"X"},null,null,{"$f":"COUNT(S17:S34)","v":0}]
["CACIT / RCACIT  / CACT  / RCACT  :",".",null," <== UPON JUDGE'S DECISION"]
["Observations :  ",null,null,null,null,null,null,null,null,null,null,null,null,null,null,null,0]
[]
[]
[]
[]
[null,null,null,null,null,null,null,null,null,null,null,null,null,null,null,null,48,"IHT1","GUARDING",null,35]
[null,null,null,null,null,null,null,null,null,null,null,null,null,null,null,null,49,"IHT1","MOVING",null,45]
[null,null,null,null,null,null,null,null,null,null,null,null,null,null,null,null,50,"IHT1","DIFFICULT PASS",null,10]
[null,null,null,null,null,null,null,null,null,null,null,null,null,null,null,null,51,"IHT1","BEHAVIOUR",null,10]
[null,null,null,null,null,null,null,null,null,null,null,null,null,null,null,null,52,"IHT2","GUARDING",null,35]
[null,null,null,null,null,null,null,null,null,null,null,null,null,null,null,null,53,"IHT2","MOVING",null,55]
[null,null,null,null,null,null,null,null,null,null,null,null,null,null,null,null,54,"IHT2","DIFFICULT PASS",null,20]
[null,null,null,null,null,null,null,null,null,null,null,null,null,null,null,null,55,"IHT2","BEHAVIOUR",null,10]
[null,null,null,null,null,null,null,null,null,null,null,null,null,null,null,null,56,"IHT3","GUARDING",null,40]
[null,null,null,null,null,null,null,null,null,null,null,null,null,null,null,null,57,"IHT3","MOVING",null,70]
[null,null,null,null,null,null,null,null,null,null,null,{"$f":"IF(B38=\"-\",\"-\",IF(B38>S58,\"EXCELLENT\",IF(B38>T58,\"TRES BON\",IF(B38>U58,\"BON\",IF(B38>V58,\"insuffisant\",IF(B37>0.1,\"insuffisant \",\"éliminé \"))))))","v":"-"},null,null,null,null,58,"IHT3","DIFFICULT PASS",null,30]
[null,null,null,null,null,null,null,null,null,null,null,null,null,null,null,null,59,"IHT3","BEHAVIOUR",null,10]
[]
[null,null,null,null,null,null,null,null,null,null,null,null,null,null,null,null,"IHT1",100,{"$f":"R58*89.999/100","v":89.998999999999995},{"$f":"R58*79.999/100","v":79.998999999999995},{"$f":"R58*69.999/100","v":69.998999999999995},{"$f":"R58*59.999/100","v":59.999000000000002},0.1]
[null,null,null,null,null,null,null,null,null,null,null,null,null,null,null,null,"iIHT2",120,{"$f":"R59*89.999/100","v":107.99879999999999},{"$f":"R59*79.999/100","v":95.998799999999989},{"$f":"R59*69.999/100","v":83.998799999999989},{"$f":"R59*59.999/100","v":71.998800000000003},0.1]
[null,null,null,null,null,null,null,null,null,null,null,null,null,null,null,null,"IHT3",150,134.99849999999998,{"$f":"R60*79.999/100","v":119.99849999999998},{"$f":"R60*69.999/100","v":104.99849999999998},{"$f":"R60*59.999/100","v":89.998500000000007},0.1]

{"sheet":"03","index":8,"n_rows":60,"n_cols":23,"rows_kept":60,"cut":false,"hidden":false,"merged":[[53,18,53,19],[54,18,54,19],[55,18,55,19],[47,18,47,19],[48,18,48,19],[49,18,49,19],[50,18,50,19],[51,18,51,19],[52,18,52,19],[38,1,38,2],[38,3,38,11],[39,1,39,11],[44,18,44,19],[45,18,45,19],[46,18,46,19],[36,1,36,2],[36,4,36,7],[36,8,36,11],[37,1,37,2],[37,3,37,4],[37,5,37,7],[37,8,37,10],[34,4,34,5],[34,6,34,7],[34,8,34,9],[34,10,34,11],[35,4,35,5],[35,6,35,7],[35,8,35,9],[35,10,35,11],[32,4,32,5],[32,6,32,7],[32,8,32,9],[32,10,32,11],[33,4,33,5],[33,6,33,7],[33,8,33,9],[33,10,33,11],[30,4,30,5],[30,6,30,7],[30,8,30,9],[30,10,30,11],[31,4,31,5],[31,6,31,7],[31,8,31,9],[31,10,31,11],[28,4,28,5],[28,6,28,7],[28,8,28,9],[28,10,28,11],[29,4,29,5],[29,6,29,7],[29,8,29,9],[29,10,29,11],[26,4,26,5],[26,6,26,7],[26,8,26,9],[26,10,26,11],[27,4,27,5],[27,6,27,7],[27,8,27,9],[27,10,27,11],[24,4,24,5],[24,6,24,7],[24,8,24,9],[24,10,24,11],[25,4,25,5],[25,6,25,7],[25,8,25,9],[25,10,25,11],[22,4,22,5],[22,6,22,7],[22,8,22,9],[22,10,22,11],[23,4,23,5],[23,6,23,7],[23,8,23,9],[23,10,23,11],[20,4,20,5],[20,6,20,7],[20,8,20,9],[20,10,20,11],[21,4,21,5],[21,6,21,7],[21,8,21,9],[21,10,21,11],[18,4,18,5],[18,6,18,7],[18,8,18,9],[18,10,18,11],[19,4,19,5],[19,6,19,7],[19,8,19,9],[19,10,19,11],[16,4,16,5],[16,6,16,7],[16,8,16,9],[16,10,16,11],[17,4,17,5],[17,6,17,7],[17,8,17,9],[17,10,17,11],[14,4,14,5],[14,6,14,7],[14,8,14,9],[14,10,14,11],[15,4,15,5],[15,6,15,7],[15,8,15,9],[15,10,15,11],[12,4,12,10],[2,1,2,10],[4,6,4,8],[6,2,6,3],[6,4,6,10],[7,4,7,10],[8,2,8,3],[8,4,8,10],[13,0,13,1],[13,2,13,3],[13,4,13,5],[13,6,13,7],[13,8,13,9],[13,10,13,11],[9,2,9,3],[9,4,9,10],[10,2,10,3],[10,4,10,10],[11,2,11,3],[11,4,11,10]]}
[null,null,null,null,null,null,"IHT TS","HWT"]
[]
[]
[]
[null,"IHT TS ",null,null,null,null,"COUNTRY LOGO"]
["Organisation",{"$f":"'Fiche organisateur N2'!F5","v":0}]
["Ville",{"$f":"'Fiche organisateur N2'!F6","v":0},"Date : ",null,{"$f":"'Fiche organisateur N2'!$H$8","v":0}]
["Contact : ",0]
["Propriètaire",{"$f":"'Fiche organisateur N2'!$C$19","v":0},"Race et sexe",null,{"$f":"'Fiche organisateur N2'!$G$19","v":0}]
["Conducteur",{"$f":"'Fiche organisateur N2'!$D$19","v":0},"Né",null,{"$f":"'Fiche organisateur N2'!$K$19","v":0}]
["Nom du chien",{"$f":"'Fiche organisateur N2'!$E$19","v":0},"PEDIGREE",null,{"$f":"'Fiche organisateur N2'!$J$19","v":0}]
["Affixe",{"$f":"'Fiche organisateur N2'!$F$19","v":0},"Identifiant ",null,{"$f":"'Fiche organisateur N2'!$L$19","v":0}]
[]
["for the country--->",null,null,null,{"$f":"'00'!E14","v":0},null,{"$f":"'00'!G14","v":0},null,{"$f":"'00'!I14","v":0},null,{"$f":"'00'!K14","v":0}]
["EXERCISES ","OBSERVATIONS","Mini","SCORE",{"$f":"'00'!E15","v":"Control of the flock"},null,{"$f":"'00'!G15","v":"MOVING"},null,{"$f":"'00'!I15","v":"DIFFICULT PASSAGES"},null,{"$f":"'00'!K15","v":"BEHAVIOUR"}]
[{"$f":"'00'!A16","v":0},{"$f":"'00'!B16","v":0},null,{"$f":"IF(COUNT(E16:L16)=0,\"-\",E16+G16+I16+K16-C16)","v":0},{"$f":"'00'!E16","v":0},null,{"$f":"'00'!G16","v":0},null,{"$f":"'00'!I16","v":0},null,{"$f":"'00'!K16","v":0}]
[0,0,null,0,{"$f":"'00'!E17","v":0},null,{"$f":"'00'!G17","v":0},null,{"$f":"'00'!I17","v":0},null,{"$f":"'00'!K17","v":0}]
[{"$f":"'00'!A18","v":0},{"$f":"'00'!B18","v":0},null,0,{"$f":"'00'!E18","v":0},null,{"$f":"'00'!G18","v":0},null,{"$f":"'00'!I18","v":0},null,{"$f":"'00'!K18","v":0}]
[{"$f":"'00'!A19","v":0},{"$f":"'00'!B19","v":0},null,0,{"$f":"'00'!E19","v":0},null,{"$f":"'00'!G19","v":0},null,{"$f":"'00'!I19","v":0},null,{"$f":"'00'!K19","v":0}]
[{"$f":"'00'!A20","v":0},{"$f":"'00'!B20","v":0},null,0,{"$f":"'00'!E20","v":0},null,{"$f":"'00'!G20","v":0},null,{"$f":"'00'!I20","v":0},null,{"$f":"'00'!K20","v":0}]
[{"$f":"'00'!A21","v":0},{"$f":"'00'!B21","v":0},null,0,{"$f":"'00'!E21","v":0},null,{"$f":"'00'!G21","v":0},null,{"$f":"'00'!I21","v":0},null,{"$f":"'00'!K21","v":0}]
[{"$f":"'00'!A22","v":0},{"$f":"'00'!B22","v":0},null,0,{"$f":"'00'!E22","v":0},null,{"$f":"'00'!G22","v":0},null,{"$f":"'00'!I22","v":0},null,{"$f":"'00'!K22","v":0}]
[{"$f":"'00'!A23","v":0},{"$f":"'00'!B23","v":0},null,0,{"$f":"'00'!E23","v":0},null,{"$f":"'00'!G23","v":0},null,{"$f":"'00'!I23","v":0},null,{"$f":"'00'!K23","v":0}]
[{"$f":"'00'!A24","v":0},{"$f":"'00'!B24","v":0},null,0,{"$f":"'00'!E24","v":0},null,{"$f":"'00'!G24","v":0},null,{"$f":"'00'!I24","v":0},null,{"$f":"'00'!K24","v":0}]
[{"$f":"'00'!A25","v":0},{"$f":"'00'!B25","v":0},null,0,{"$f":"'00'!E25","v":0},null,{"$f":"'00'!G25","v":0},null,{"$f":"'00'!I25","v":0},null,{"$f":"'00'!K25","v":0}]
[{"$f":"'00'!A26","v":0},{"$f":"'00'!B26","v":0},null,0,{"$f":"'00'!E26","v":0},null,{"$f":"'00'!G26","v":0},null,{"$f":"'00'!I26","v":0},null,{"$f":"'00'!K26","v":0}]
[{"$f":"'00'!A27","v":0},{"$f":"'00'!B27","v":0},null,0,{"$f":"'00'!E27","v":0},null,{"$f":"'00'!G27","v":0},null,{"$f":"'00'!I27","v":0},null,{"$f":"'00'!K27","v":0}]
[{"$f":"'00'!A28","v":0},{"$f":"'00'!B28","v":0},null,0,{"$f":"'00'!E28","v":0},null,{"$f":"'00'!G28","v":0},null,{"$f":"'00'!I28","v":0},null,{"$f":"'00'!K28","v":0}]
[{"$f":"'00'!A29","v":0},{"$f":"'00'!B29","v":0},null,0,{"$f":"'00'!E29","v":0},null,{"$f":"'00'!G29","v":0},null,{"$f":"'00'!I29","v":0},null,{"$f":"'00'!K29","v":0}]
[{"$f":"'00'!A30","v":0},{"$f":"'00'!B30","v":0},null,0,{"$f":"'00'!E30","v":0},null,{"$f":"'00'!G30","v":0},null,{"$f":"'00'!I30","v":0},null,{"$f":"'00'!K30","v":0}]
[{"$f":"'00'!A31","v":0},{"$f":"'00'!B31","v":0},null,0,{"$f":"'00'!E31","v":0},null,{"$f":"'00'!G31","v":0},null,{"$f":"'00'!I31","v":0},null,{"$f":"'00'!K31","v":0}]
[{"$f":"'00'!A32","v":"Aptitude naturelle"},{"$f":"'00'!B32","v":0},null,0,{"$f":"'00'!E32","v":0},null,{"$f":"'00'!G32","v":0},null,{"$f":"'00'!I32","v":0},null,{"$f":"'00'!K32","v":0}]
[{"$f":"'00'!A33","v":"Gentillesse"},{"$f":"'00'!B33","v":0},null,0,{"$f":"'00'!E33","v":0},null,{"$f":"'00'!G33","v":0},null,{"$f":"'00'!I33","v":0},null,{"$f":"'00'!K33","v":0}]
[{"$f":"'00'!A34","v":"Intelligence de l'execution"},{"$f":"'00'!B34","v":0},null,0,{"$f":"'00'!E34","v":0},null,{"$f":"'00'!G34","v":0},null,{"$f":"'00'!I34","v":0},null,{"$f":"'00'!K34","v":0}]
[{"$f":"'00'!A35","v":"Obéissance"},{"$f":"'00'!B35","v":0},null,0,{"$f":"'00'!E35","v":0},null,{"$f":"'00'!G35","v":0},null,{"$f":"'00'!I35","v":0},null,{"$f":"'00'!K35","v":0}]
["POINTS TOTAL",null,{"$f":"SUM(C16:C35)","v":0},{"$f":"SUM(D16:D35)","v":0},{"$f":"'00'!E36","v":50},null,{"$f":"'00'!G36","v":30},null,{"$f":"'00'!I36","v":0},null,{"$f":"'00'!K36","v":20}]
["Détails des pénéalités ",null,null,"0","Pénalités en Négatif",null,null,null,"RANKING"]
[" POINTS",{"$f":"IF((C36)=0,\"-\",D36+D37)","v":"-"},{"$f":"IF(COUNT(D38:K38)=0,\"-\",D38+F38+H38+J38-B38)","v":"-"},"EVALUATION",null,{"$f":"$L$55","v":"-"},null,null,{"$f":"'Rapport de concours '!N19","v":"X"},null,null,{"$f":"COUNT(S17:S34)","v":0}]
["CACIT / RCACIT  / CACT  / RCACT  :",".",null," <== UPON JUDGE'S DECISION"]
["Observations :  ",null,null,null,null,null,null,null,null,null,null,null,null,null,null,null,0]
[]
[]
[]
[]
[null,null,null,null,null,null,null,null,null,null,null,null,null,null,null,null,48,"IHT1","GUARDING",null,35]
[null,null,null,null,null,null,null,null,null,null,null,null,null,null,null,null,49,"IHT1","MOVING",null,45]
[null,null,null,null,null,null,null,null,null,null,null,null,null,null,null,null,50,"IHT1","DIFFICULT PASS",null,10]
[null,null,null,null,null,null,null,null,null,null,null,null,null,null,null,null,51,"IHT1","BEHAVIOUR",null,10]
[null,null,null,null,null,null,null,null,null,null,null,null,null,null,null,null,52,"IHT2","GUARDING",null,35]
[null,null,null,null,null,null,null,null,null,null,null,null,null,null,null,null,53,"IHT2","MOVING",null,55]
[null,null,null,null,null,null,null,null,null,null,null,null,null,null,null,null,54,"IHT2","DIFFICULT PASS",null,20]
[null,null,null,null,null,null,null,null,null,null,null,null,null,null,null,null,55,"IHT2","BEHAVIOUR",null,10]
[null,null,null,null,null,null,null,null,null,null,null,null,null,null,null,null,56,"IHT3","GUARDING",null,40]
[null,null,null,null,null,null,null,null,null,null,null,null,null,null,null,null,57,"IHT3","MOVING",null,70]
[null,null,null,null,null,null,null,null,null,null,null,{"$f":"IF(B38=\"-\",\"-\",IF(B38>S58,\"EXCELLENT\",IF(B38>T58,\"TRES BON\",IF(B38>U58,\"BON\",IF(B38>V58,\"insuffisant\",IF(B37>0.1,\"insuffisant \",\"éliminé \"))))))","v":"-"},null,null,null,null,58,"IHT3","DIFFICULT PASS",null,30]
[null,null,null,null,null,null,null,null,null,null,null,null,null,null,null,null,59,"IHT3","BEHAVIOUR",null,10]
[]
[null,null,null,null,null,null,null,null,null,null,null,null,null,null,null,null,"IHT1",100,{"$f":"R58*89.999/100","v":89.998999999999995},{"$f":"R58*79.999/100","v":79.998999999999995},{"$f":"R58*69.999/100","v":69.998999999999995},{"$f":"R58*59.999/100","v":59.999000000000002},0.1]
[null,null,null,null,null,null,null,null,null,null,null,null,null,null,null,null,"iIHT2",120,{"$f":"R59*89.999/100","v":107.99879999999999},{"$f":"R59*79.999/100","v":95.998799999999989},{"$f":"R59*69.999/100","v":83.998799999999989},{"$f":"R59*59.999/100","v":71.998800000000003},0.1]
[null,null,null,null,null,null,null,null,null,null,null,null,null,null,null,null,"IHT3",150,134.99849999999998,{"$f":"R60*79.999/100","v":119.99849999999998},{"$f":"R60*69.999/100","v":104.99849999999998},{"$f":"R60*59.999/100","v":89.998500000000007},0.1]

{"sheet":"04","index":9,"n_rows":60,"n_cols":23,"rows_kept":60,"cut":false,"hidden":false,"merged":[[2,1,2,10],[4,6,4,8],[6,2,6,3],[6,4,6,10],[7,4,7,10],[8,2,8,3],[8,4,8,10],[13,0,13,1],[13,2,13,3],[13,4,13,5],[13,6,13,7],[13,8,13,9],[13,10,13,11],[9,2,9,3],[9,4,9,10],[10,2,10,3],[10,4,10,10],[11,2,11,3],[11,4,11,10],[14,4,14,5],[14,6,14,7],[14,8,14,9],[14,10,14,11],[15,4,15,5],[15,6,15,7],[15,8,15,9],[15,10,15,11],[12,4,12,10],[18,4,18,5],[18,6,18,7],[18,8,18,9],[18,10,18,11],[19,4,19,5],[19,6,19,7],[19,8,19,9],[19,10,19,11],[16,4,16,5],[16,6,16,7],[16,8,16,9],[16,10,16,11],[17,4,17,5],[17,6,17,7],[17,8,17,9],[17,10,17,11],[22,4,22,5],[22,6,22,7],[22,8,22,9],[22,10,22,11],[23,4,23,5],[23,6,23,7],[23,8,23,9],[23,10,23,11],[20,4,20,5],[20,6,20,7],[20,8,20,9],[20,10,20,11],[21,4,21,5],[21,6,21,7],[21,8,21,9],[21,10,21,11],[26,4,26,5],[26,6,26,7],[26,8,26,9],[26,10,26,11],[27,4,27,5],[27,6,27,7],[27,8,27,9],[27,10,27,11],[24,4,24,5],[24,6,24,7],[24,8,24,9],[24,10,24,11],[25,4,25,5],[25,6,25,7],[25,8,25,9],[25,10,25,11],[30,4,30,5],[30,6,30,7],[30,8,30,9],[30,10,30,11],[31,4,31,5],[31,6,31,7],[31,8,31,9],[31,10,31,11],[28,4,28,5],[28,6,28,7],[28,8,28,9],[28,10,28,11],[29,4,29,5],[29,6,29,7],[29,8,29,9],[29,10,29,11],[34,4,34,5],[34,6,34,7],[34,8,34,9],[34,10,34,11],[35,4,35,5],[35,6,35,7],[35,8,35,9],[35,10,35,11],[32,4,32,5],[32,6,32,7],[32,8,32,9],[32,10,32,11],[33,4,33,5],[33,6,33,7],[33,8,33,9],[33,10,33,11],[38,1,38,2],[38,3,38,11],[39,1,39,11],[44,18,44,19],[45,18,45,19],[46,18,46,19],[36,1,36,2],[36,4,36,7],[36,8,36,11],[37,1,37,2],[37,3,37,4],[37,5,37,7],[37,8,37,10],[53,18,53,19],[54,18,54,19],[55,18,55,19],[47,18,47,19],[48,18,48,19],[49,18,49,19],[50,18,50,19],[51,18,51,19],[52,18,52,19]]}
[null,null,null,null,null,null,"IHT TS","HWT"]
[]
[]
[]
[null,"IHT TS ",null,null,null,null,"COUNTRY LOGO"]
["Organisation",{"$f":"'Fiche organisateur N2'!F5","v":0}]
["Ville",{"$f":"'Fiche organisateur N2'!F6","v":0},"Date : ",null,{"$f":"'Fiche organisateur N2'!$H$8","v":0}]
["Contact : ",0]
["Propriètaire",{"$f":"'Fiche organisateur N2'!$C$20","v":0},"Race et sexe",null,{"$f":"'Fiche organisateur N2'!$G$20","v":0}]
["Conducteur",{"$f":"'Fiche organisateur N2'!$D$20","v":0},"Né",null,{"$f":"'Fiche organisateur N2'!$K$20","v":0}]
["Nom du chien",{"$f":"'Fiche organisateur N2'!$E$20","v":0},"PEDIGREE",null,{"$f":"'Fiche organisateur N2'!$J$20","v":0}]
["Affixe",{"$f":"'Fiche organisateur N2'!$F$20","v":0},"Identifiant ",null,{"$f":"'Fiche organisateur N2'!$L$20","v":0}]
[]
["for the country--->",null,null,null,{"$f":"'00'!E14","v":0},null,{"$f":"'00'!G14","v":0},null,{"$f":"'00'!I14","v":0},null,{"$f":"'00'!K14","v":0}]
["EXERCISES ","OBSERVATIONS","Mini","SCORE",{"$f":"'00'!E15","v":"Control of the flock"},null,{"$f":"'00'!G15","v":"MOVING"},null,{"$f":"'00'!I15","v":"DIFFICULT PASSAGES"},null,{"$f":"'00'!K15","v":"BEHAVIOUR"}]
[{"$f":"'00'!A16","v":0},null,null,{"$f":"IF(COUNT(E16:L16)=0,\"-\",E16+G16+I16+K16-C16)","v":0},{"$f":"'00'!E16","v":0},null,{"$f":"'00'!G16","v":0},null,{"$f":"'00'!I16","v":0},null,{"$f":"'00'!K16","v":0}]
[0,null,null,0,{"$f":"'00'!E17","v":0},null,{"$f":"'00'!G17","v":0},null,{"$f":"'00'!I17","v":0},null,{"$f":"'00'!K17","v":0}]
[{"$f":"'00'!A18","v":0},null,null,0,{"$f":"'00'!E18","v":0},null,{"$f":"'00'!G18","v":0},null,{"$f":"'00'!I18","v":0},null,{"$f":"'00'!K18","v":0}]
[{"$f":"'00'!A19","v":0},null,null,0,{"$f":"'00'!E19","v":0},null,{"$f":"'00'!G19","v":0},null,{"$f":"'00'!I19","v":0},null,{"$f":"'00'!K19","v":0}]
[{"$f":"'00'!A20","v":0},null,null,0,{"$f":"'00'!E20","v":0},null,{"$f":"'00'!G20","v":0},null,{"$f":"'00'!I20","v":0},null,{"$f":"'00'!K20","v":0}]
[{"$f":"'00'!A21","v":0},null,null,0,{"$f":"'00'!E21","v":0},null,{"$f":"'00'!G21","v":0},null,{"$f":"'00'!I21","v":0},null,{"$f":"'00'!K21","v":0}]
[{"$f":"'00'!A22","v":0},null,null,0,{"$f":"'00'!E22","v":0},null,{"$f":"'00'!G22","v":0},null,{"$f":"'00'!I22","v":0},null,{"$f":"'00'!K22","v":0}]
[{"$f":"'00'!A23","v":0},null,null,0,{"$f":"'00'!E23","v":0},null,{"$f":"'00'!G23","v":0},null,{"$f":"'00'!I23","v":0},null,{"$f":"'00'!K23","v":0}]
[{"$f":"'00'!A24","v":0},null,null,0,{"$f":"'00'!E24","v":0},null,{"$f":"'00'!G24","v":0},null,{"$f":"'00'!I24","v":0},null,{"$f":"'00'!K24","v":0}]
[{"$f":"'00'!A25","v":0},null,null,0,{"$f":"'00'!E25","v":0},null,{"$f":"'00'!G25","v":0},null,{"$f":"'00'!I25","v":0},null,{"$f":"'00'!K25","v":0}]
[{"$f":"'00'!A26","v":0},null,null,0,{"$f":"'00'!E26","v":0},null,{"$f":"'00'!G26","v":0},null,{"$f":"'00'!I26","v":0},null,{"$f":"'00'!K26","v":0}]
[{"$f":"'00'!A27","v":0},null,null,0,{"$f":"'00'!E27","v":0},null,{"$f":"'00'!G27","v":0},null,{"$f":"'00'!I27","v":0},null,{"$f":"'00'!K27","v":0}]
[{"$f":"'00'!A28","v":0},null,null,0,{"$f":"'00'!E28","v":0},null,{"$f":"'00'!G28","v":0},null,{"$f":"'00'!I28","v":0},null,{"$f":"'00'!K28","v":0}]
[{"$f":"'00'!A29","v":0},null,null,0,{"$f":"'00'!E29","v":0},null,{"$f":"'00'!G29","v":0},null,{"$f":"'00'!I29","v":0},null,{"$f":"'00'!K29","v":0}]
[{"$f":"'00'!A30","v":0},null,null,0,{"$f":"'00'!E30","v":0},null,{"$f":"'00'!G30","v":0},null,{"$f":"'00'!I30","v":0},null,{"$f":"'00'!K30","v":0}]
[{"$f":"'00'!A31","v":0},null,null,0,{"$f":"'00'!E31","v":0},null,{"$f":"'00'!G31","v":0},null,{"$f":"'00'!I31","v":0},null,{"$f":"'00'!K31","v":0}]
[{"$f":"'00'!A32","v":"Aptitude naturelle"},null,null,0,{"$f":"'00'!E32","v":0},null,{"$f":"'00'!G32","v":0},null,{"$f":"'00'!I32","v":0},null,{"$f":"'00'!K32","v":0}]
[{"$f":"'00'!A33","v":"Gentillesse"},null,null,0,{"$f":"'00'!E33","v":0},null,{"$f":"'00'!G33","v":0},null,{"$f":"'00'!I33","v":0},null,{"$f":"'00'!K33","v":0}]
[{"$f":"'00'!A34","v":"Intelligence de l'execution"},null,null,0,{"$f":"'00'!E34","v":0},null,{"$f":"'00'!G34","v":0},null,{"$f":"'00'!I34","v":0},null,{"$f":"'00'!K34","v":0}]
[{"$f":"'00'!A35","v":"Obéissance"},null,null,0,{"$f":"'00'!E35","v":0},null,{"$f":"'00'!G35","v":0},null,{"$f":"'00'!I35","v":0},null,{"$f":"'00'!K35","v":0}]
["POINTS TOTAL",null,{"$f":"SUM(C16:C35)","v":0},{"$f":"SUM(D16:D35)","v":0},{"$f":"'00'!E36","v":50},null,{"$f":"'00'!G36","v":30},null,{"$f":"'00'!I36","v":0},null,{"$f":"'00'!K36","v":20}]
["Détails des pénéalités ",null,null,"0","Pénalités en Négatif",null,null,null,"RANKING"]
[" POINTS",{"$f":"IF((C36)=0,\"-\",D36+D37)","v":"-"},{"$f":"IF(COUNT(D38:K38)=0,\"-\",D38+F38+H38+J38-B38)","v":"-"},"EVALUATION",null,{"$f":"$L$55","v":"-"},null,null,{"$f":"'Rapport de concours '!N20","v":"X"},null,null,{"$f":"COUNT(S17:S34)","v":0}]
["CACIT / RCACIT  / CACT  / RCACT  :",".",null," <== UPON JUDGE'S DECISION"]
["Observations :  ",null,null,null,null,null,null,null,null,null,null,null,null,null,null,null,0]
[]
[]
[]
[]
[null,null,null,null,null,null,null,null,null,null,null,null,null,null,null,null,48,"IHT1","GUARDING",null,35]
[null,null,null,null,null,null,null,null,null,null,null,null,null,null,null,null,49,"IHT1","MOVING",null,45]
[null,null,null,null,null,null,null,null,null,null,null,null,null,null,null,null,50,"IHT1","DIFFICULT PASS",null,10]
[null,null,null,null,null,null,null,null,null,null,null,null,null,null,null,null,51,"IHT1","BEHAVIOUR",null,10]
[null,null,null,null,null,null,null,null,null,null,null,null,null,null,null,null,52,"IHT2","GUARDING",null,35]
[null,null,null,null,null,null,null,null,null,null,null,null,null,null,null,null,53,"IHT2","MOVING",null,55]
[null,null,null,null,null,null,null,null,null,null,null,null,null,null,null,null,54,"IHT2","DIFFICULT PASS",null,20]
[null,null,null,null,null,null,null,null,null,null,null,null,null,null,null,null,55,"IHT2","BEHAVIOUR",null,10]
[null,null,null,null,null,null,null,null,null,null,null,null,null,null,null,null,56,"IHT3","GUARDING",null,40]
[null,null,null,null,null,null,null,null,null,null,null,null,null,null,null,null,57,"IHT3","MOVING",null,70]
[null,null,null,null,null,null,null,null,null,null,null,{"$f":"IF(B38=\"-\",\"-\",IF(B38>S58,\"EXCELLENT\",IF(B38>T58,\"TRES BON\",IF(B38>U58,\"BON\",IF(B38>V58,\"insuffisant\",IF(B37>0.1,\"insuffisant \",\"éliminé \"))))))","v":"-"},null,null,null,null,58,"IHT3","DIFFICULT PASS",null,30]
[null,null,null,null,null,null,null,null,null,null,null,null,null,null,null,null,59,"IHT3","BEHAVIOUR",null,10]
[]
[null,null,null,null,null,null,null,null,null,null,null,null,null,null,null,null,"IHT1",100,{"$f":"R58*89.999/100","v":89.998999999999995},{"$f":"R58*79.999/100","v":79.998999999999995},{"$f":"R58*69.999/100","v":69.998999999999995},{"$f":"R58*59.999/100","v":59.999000000000002},0.1]
[null,null,null,null,null,null,null,null,null,null,null,null,null,null,null,null,"iIHT2",120,{"$f":"R59*89.999/100","v":107.99879999999999},{"$f":"R59*79.999/100","v":95.998799999999989},{"$f":"R59*69.999/100","v":83.998799999999989},{"$f":"R59*59.999/100","v":71.998800000000003},0.1]
[null,null,null,null,null,null,null,null,null,null,null,null,null,null,null,null,"IHT3",150,134.99849999999998,{"$f":"R60*79.999/100","v":119.99849999999998},{"$f":"R60*69.999/100","v":104.99849999999998},{"$f":"R60*59.999/100","v":89.998500000000007},0.1]

{"sheet":"05","index":10,"n_rows":60,"n_cols":23,"rows_kept":60,"cut":false,"hidden":false,"merged":[[2,1,2,10],[4,6,4,8],[6,2,6,3],[6,4,6,10],[7,4,7,10],[8,2,8,3],[8,4,8,10],[13,0,13,1],[13,2,13,3],[13,4,13,5],[13,6,13,7],[13,8,13,9],[13,10,13,11],[9,2,9,3],[9,4,9,10],[10,2,10,3],[10,4,10,10],[11,2,11,3],[11,4,11,10],[14,4,14,5],[14,6,14,7],[14,8,14,9],[14,10,14,11],[15,4,15,5],[15,6,15,7],[15,8,15,9],[15,10,15,11],[12,4,12,10],[18,4,18,5],[18,6,18,7],[18,8,18,9],[18,10,18,11],[19,4,19,5],[19,6,19,7],[19,8,19,9],[19,10,19,11],[16,4,16,5],[16,6,16,7],[16,8,16,9],[16,10,16,11],[17,4,17,5],[17,6,17,7],[17,8,17,9],[17,10,17,11],[22,4,22,5],[22,6,22,7],[22,8,22,9],[22,10,22,11],[23,4,23,5],[23,6,23,7],[23,8,23,9],[23,10,23,11],[20,4,20,5],[20,6,20,7],[20,8,20,9],[20,10,20,11],[21,4,21,5],[21,6,21,7],[21,8,21,9],[21,10,21,11],[26,4,26,5],[26,6,26,7],[26,8,26,9],[26,10,26,11],[27,4,27,5],[27,6,27,7],[27,8,27,9],[27,10,27,11],[24,4,24,5],[24,6,24,7],[24,8,24,9],[24,10,24,11],[25,4,25,5],[25,6,25,7],[25,8,25,9],[25,10,25,11],[30,4,30,5],[30,6,30,7],[30,8,30,9],[30,10,30,11],[31,4,31,5],[31,6,31,7],[31,8,31,9],[31,10,31,11],[28,4,28,5],[28,6,28,7],[28,8,28,9],[28,10,28,11],[29,4,29,5],[29,6,29,7],[29,8,29,9],[29,10,29,11],[34,4,34,5],[34,6,34,7],[34,8,34,9],[34,10,34,11],[35,4,35,5],[35,6,35,7],[35,8,35,9],[35,10,35,11],[32,4,32,5],[32,6,32,7],[32,8,32,9],[32,10,32,11],[33,4,33,5],[33,6,33,7],[33,8,33,9],[33,10,33,11],[38,1,38,2],[38,3,38,11],[39,1,39,11],[44,18,44,19],[45,18,45,19],[46,18,46,19],[36,1,36,2],[36,4,36,7],[36,8,36,11],[37,1,37,2],[37,3,37,4],[37,5,37,7],[37,8,37,10],[53,18,53,19],[54,18,54,19],[55,18,55,19],[47,18,47,19],[48,18,48,19],[49,18,49,19],[50,18,50,19],[51,18,51,19],[52,18,52,19]]}
[null,null,null,null,null,null,"IHT TS","HWT"]
[]
[]
[]
[null,"IHT TS ",null,null,null,null,"COUNTRY LOGO"]
["Organisation",{"$f":"'Fiche organisateur N2'!F5","v":0}]
["Ville",{"$f":"'Fiche organisateur N2'!F6","v":0},"Date : ",null,{"$f":"'Fiche organisateur N2'!$H$8","v":0}]
["Contact : ",0]
["Propriètaire",{"$f":"'Fiche organisateur N2'!$C$21","v":0},"Race et sexe",null,{"$f":"'Fiche organisateur N2'!$G$21","v":0}]
["Conducteur",{"$f":"'Fiche organisateur N2'!$D$21","v":0},"Né",null,{"$f":"'Fiche organisateur N2'!$K$21","v":0}]
["Nom du chien",{"$f":"'Fiche organisateur N2'!$E$21","v":0},"PEDIGREE",null,{"$f":"'Fiche organisateur N2'!$J$21","v":0}]
["Affixe",{"$f":"'Fiche organisateur N2'!$F$21","v":0},"Identifiant ",null,{"$f":"'Fiche organisateur N2'!$L$21","v":0}]
[]
["for the country--->"]
["EXERCISES ","OBSERVATIONS","Mini","SCORE","GUARDING",null,"MOVING",null,"DIFFICULT PASSAGES",null,"BEHAVIOUR"]
[{"$f":"'00'!A16","v":0},null,null,{"$f":"IF(COUNT(E16:L16)=0,\"-\",E16+G16+I16+K16-C16)","v":0},{"$f":"'00'!E16","v":0},null,{"$f":"'00'!G16","v":0},null,{"$f":"'00'!I16","v":0},null,{"$f":"'00'!K16","v":0}]
[0,null,null,0,{"$f":"'00'!E17","v":0},null,{"$f":"'00'!G17","v":0},null,{"$f":"'00'!I17","v":0},null,{"$f":"'00'!K17","v":0}]
[{"$f":"'00'!A18","v":0},null,null,0,{"$f":"'00'!E18","v":0},null,{"$f":"'00'!G18","v":0},null,{"$f":"'00'!I18","v":0},null,{"$f":"'00'!K18","v":0}]
[{"$f":"'00'!A19","v":0},null,null,0,{"$f":"'00'!E19","v":0},null,{"$f":"'00'!G19","v":0},null,{"$f":"'00'!I19","v":0},null,{"$f":"'00'!K19","v":0}]
[{"$f":"'00'!A20","v":0},null,null,0,{"$f":"'00'!E20","v":0},null,{"$f":"'00'!G20","v":0},null,{"$f":"'00'!I20","v":0},null,{"$f":"'00'!K20","v":0}]
[{"$f":"'00'!A21","v":0},null,null,0,{"$f":"'00'!E21","v":0},null,{"$f":"'00'!G21","v":0},null,{"$f":"'00'!I21","v":0},null,{"$f":"'00'!K21","v":0}]
[{"$f":"'00'!A22","v":0},null,null,0,{"$f":"'00'!E22","v":0},null,{"$f":"'00'!G22","v":0},null,{"$f":"'00'!I22","v":0},null,{"$f":"'00'!K22","v":0}]
[{"$f":"'00'!A23","v":0},null,null,0,{"$f":"'00'!E23","v":0},null,{"$f":"'00'!G23","v":0},null,{"$f":"'00'!I23","v":0},null,{"$f":"'00'!K23","v":0}]
[{"$f":"'00'!A24","v":0},null,null,0,{"$f":"'00'!E24","v":0},null,{"$f":"'00'!G24","v":0},null,{"$f":"'00'!I24","v":0},null,{"$f":"'00'!K24","v":0}]
[{"$f":"'00'!A25","v":0},null,null,0,{"$f":"'00'!E25","v":0},null,{"$f":"'00'!G25","v":0},null,{"$f":"'00'!I25","v":0},null,{"$f":"'00'!K25","v":0}]
[{"$f":"'00'!A26","v":0},null,null,0,{"$f":"'00'!E26","v":0},null,{"$f":"'00'!G26","v":0},null,{"$f":"'00'!I26","v":0},null,{"$f":"'00'!K26","v":0}]
[{"$f":"'00'!A27","v":0},null,null,0,{"$f":"'00'!E27","v":0},null,{"$f":"'00'!G27","v":0},null,{"$f":"'00'!I27","v":0},null,{"$f":"'00'!K27","v":0}]
[{"$f":"'00'!A28","v":0},null,null,0,{"$f":"'00'!E28","v":0},null,{"$f":"'00'!G28","v":0},null,{"$f":"'00'!I28","v":0},null,{"$f":"'00'!K28","v":0}]
[{"$f":"'00'!A29","v":0},null,null,0,{"$f":"'00'!E29","v":0},null,{"$f":"'00'!G29","v":0},null,{"$f":"'00'!I29","v":0},null,{"$f":"'00'!K29","v":0}]
[{"$f":"'00'!A30","v":0},null,null,0,{"$f":"'00'!E30","v":0},null,{"$f":"'00'!G30","v":0},null,{"$f":"'00'!I30","v":0},null,{"$f":"'00'!K30","v":0}]
[{"$f":"'00'!A31","v":0},null,null,0,{"$f":"'00'!E31","v":0},null,{"$f":"'00'!G31","v":0},null,{"$f":"'00'!I31","v":0},null,{"$f":"'00'!K31","v":0}]
[{"$f":"'00'!A32","v":"Aptitude naturelle"},null,null,0,{"$f":"'00'!E32","v":0},null,{"$f":"'00'!G32","v":0},null,{"$f":"'00'!I32","v":0},null,{"$f":"'00'!K32","v":0}]
[{"$f":"'00'!A33","v":"Gentillesse"},null,null,0,{"$f":"'00'!E33","v":0},null,{"$f":"'00'!G33","v":0},null,{"$f":"'00'!I33","v":0},null,{"$f":"'00'!K33","v":0}]
[{"$f":"'00'!A34","v":"Intelligence de l'execution"},null,null,0,{"$f":"'00'!E34","v":0},null,{"$f":"'00'!G34","v":0},null,{"$f":"'00'!I34","v":0},null,{"$f":"'00'!K34","v":0}]
[{"$f":"'00'!A35","v":"Obéissance"},null,null,0,{"$f":"'00'!E35","v":0},null,{"$f":"'00'!G35","v":0},null,{"$f":"'00'!I35","v":0},null,{"$f":"'00'!K35","v":0}]
["POINTS TOTAL",null,{"$f":"SUM(C16:C35)","v":0},{"$f":"SUM(D16:D35)","v":0},{"$f":"'00'!E36","v":50},null,{"$f":"'00'!G36","v":30},null,{"$f":"'00'!I36","v":0},null,{"$f":"'00'!K36","v":20}]
["Détails des pénéalités ",null,null,"0","Pénalités en Négatif",null,null,null,"RANKING"]
[" POINTS",{"$f":"IF((C36)=0,\"-\",D36+D37)","v":"-"},{"$f":"IF(COUNT(D38:K38)=0,\"-\",D38+F38+H38+J38-B38)","v":"-"},"EVALUATION",null,{"$f":"$L$55","v":"-"},null,null,{"$f":"'Rapport de concours '!N21","v":"X"},null,null,{"$f":"COUNT(S17:S34)","v":0}]
["CACIT / RCACIT  / CACT  / RCACT  :",".",null," <== UPON JUDGE'S DECISION"]
["Observations :  ",null,null,null,null,null,null,null,null,null,null,null,null,null,null,null,0]
[]
[]
[]
[]
[null,null,null,null,null,null,null,null,null,null,null,null,null,null,null,null,48,"IHT1","GUARDING",null,35]
[null,null,null,null,null,null,null,null,null,null,null,null,null,null,null,null,49,"IHT1","MOVING",null,45]
[null,null,null,null,null,null,null,null,null,null,null,null,null,null,null,null,50,"IHT1","DIFFICULT PASS",null,10]
[null,null,null,null,null,null,null,null,null,null,null,null,null,null,null,null,51,"IHT1","BEHAVIOUR",null,10]
[null,null,null,null,null,null,null,null,null,null,null,null,null,null,null,null,52,"IHT2","GUARDING",null,35]
[null,null,null,null,null,null,null,null,null,null,null,null,null,null,null,null,53,"IHT2","MOVING",null,55]
[null,null,null,null,null,null,null,null,null,null,null,null,null,null,null,null,54,"IHT2","DIFFICULT PASS",null,20]
[null,null,null,null,null,null,null,null,null,null,null,null,null,null,null,null,55,"IHT2","BEHAVIOUR",null,10]
[null,null,null,null,null,null,null,null,null,null,null,null,null,null,null,null,56,"IHT3","GUARDING",null,40]
[null,null,null,null,null,null,null,null,null,null,null,null,null,null,null,null,57,"IHT3","MOVING",null,70]
[null,null,null,null,null,null,null,null,null,null,null,{"$f":"IF(B38=\"-\",\"-\",IF(B38>S58,\"EXCELLENT\",IF(B38>T58,\"TRES BON\",IF(B38>U58,\"BON\",IF(B38>V58,\"insuffisant\",IF(B37>0.1,\"insuffisant \",\"éliminé \"))))))","v":"-"},null,null,null,null,58,"IHT3","DIFFICULT PASS",null,30]
[null,null,null,null,null,null,null,null,null,null,null,null,null,null,null,null,59,"IHT3","BEHAVIOUR",null,10]
[]
[null,null,null,null,null,null,null,null,null,null,null,null,null,null,null,null,"IHT1",100,{"$f":"R58*89.999/100","v":89.998999999999995},{"$f":"R58*79.999/100","v":79.998999999999995},{"$f":"R58*69.999/100","v":69.998999999999995},{"$f":"R58*59.999/100","v":59.999000000000002},0.1]
[null,null,null,null,null,null,null,null,null,null,null,null,null,null,null,null,"iIHT2",120,{"$f":"R59*89.999/100","v":107.99879999999999},{"$f":"R59*79.999/100","v":95.998799999999989},{"$f":"R59*69.999/100","v":83.998799999999989},{"$f":"R59*59.999/100","v":71.998800000000003},0.1]
[null,null,null,null,null,null,null,null,null,null,null,null,null,null,null,null,"IHT3",150,134.99849999999998,{"$f":"R60*79.999/100","v":119.99849999999998},{"$f":"R60*69.999/100","v":104.99849999999998},{"$f":"R60*59.999/100","v":89.998500000000007},0.1]

{"sheet":"06","index":11,"n_rows":60,"n_cols":23,"rows_kept":60,"cut":false,"hidden":false,"merged":[[2,1,2,10],[4,6,4,8],[6,2,6,3],[6,4,6,10],[7,4,7,10],[8,2,8,3],[8,4,8,10],[13,0,13,1],[13,2,13,3],[13,4,13,5],[13,6,13,7],[13,8,13,9],[13,10,13,11],[9,2,9,3],[9,4,9,10],[10,2,10,3],[10,4,10,10],[11,2,11,3],[11,4,11,10],[14,4,14,5],[14,6,14,7],[14,8,14,9],[14,10,14,11],[15,4,15,5],[15,6,15,7],[15,8,15,9],[15,10,15,11],[12,4,12,10],[18,4,18,5],[18,6,18,7],[18,8,18,9],[18,10,18,11],[19,4,19,5],[19,6,19,7],[19,8,19,9],[19,10,19,11],[16,4,16,5],[16,6,16,7],[16,8,16,9],[16,10,16,11],[17,4,17,5],[17,6,17,7],[17,8,17,9],[17,10,17,11],[22,4,22,5],[22,6,22,7],[22,8,22,9],[22,10,22,11],[23,4,23,5],[23,6,23,7],[23,8,23,9],[23,10,23,11],[20,4,20,5],[20,6,20,7],[20,8,20,9],[20,10,20,11],[21,4,21,5],[21,6,21,7],[21,8,21,9],[21,10,21,11],[26,4,26,5],[26,6,26,7],[26,8,26,9],[26,10,26,11],[27,4,27,5],[27,6,27,7],[27,8,27,9],[27,10,27,11],[24,4,24,5],[24,6,24,7],[24,8,24,9],[24,10,24,11],[25,4,25,5],[25,6,25,7],[25,8,25,9],[25,10,25,11],[30,4,30,5],[30,6,30,7],[30,8,30,9],[30,10,30,11],[31,4,31,5],[31,6,31,7],[31,8,31,9],[31,10,31,11],[28,4,28,5],[28,6,28,7],[28,8,28,9],[28,10,28,11],[29,4,29,5],[29,6,29,7],[29,8,29,9],[29,10,29,11],[34,4,34,5],[34,6,34,7],[34,8,34,9],[34,10,34,11],[35,4,35,5],[35,6,35,7],[35,8,35,9],[35,10,35,11],[32,4,32,5],[32,6,32,7],[32,8,32,9],[32,10,32,11],[33,4,33,5],[33,6,33,7],[33,8,33,9],[33,10,33,11],[38,1,38,2],[38,3,38,11],[39,1,39,11],[44,18,44,19],[45,18,45,19],[46,18,46,19],[36,1,36,2],[36,4,36,7],[36,8,36,11],[37,1,37,2],[37,3,37,4],[37,5,37,7],[37,8,37,10],[53,18,53,19],[54,18,54,19],[55,18,55,19],[47,18,47,19],[48,18,48,19],[49,18,49,19],[50,18,50,19],[51,18,51,19],[52,18,52,19]]}
[null,null,null,null,null,null,"IHT TS","HWT"]
[]
[]
[]
[null,"IHT TS ",null,null,null,null,"COUNTRY LOGO"]
["Organisation",{"$f":"'Fiche organisateur N2'!F5","v":0}]
["Ville",{"$f":"'Fiche organisateur N2'!F6","v":0},"Date : ",null,{"$f":"'Fiche organisateur N2'!$H$8","v":0}]
["Contact : ",0]
["Propriètaire",{"$f":"'Fiche organisateur N2'!$C$22","v":0},"Race et sexe",null,{"$f":"'Fiche organisateur N2'!$G$22","v":0}]
["Conducteur",{"$f":"'Fiche organisateur N2'!$D$22","v":0},"Né",null,{"$f":"'Fiche organisateur N2'!$K$22","v":0}]
["Nom du chien",{"$f":"'Fiche organisateur N2'!$E$22","v":0},"PEDIGREE",null,{"$f":"'Fiche organisateur N2'!$J$22","v":0}]
["Affixe",{"$f":"'Fiche organisateur N2'!$F$22","v":0},"Identifiant ",null,{"$f":"'Fiche organisateur N2'!$L$22","v":0}]
[]
["for the country--->"]
["EXERCISES ","OBSERVATIONS","Mini","SCORE","GUARDING",null,"MOVING",null,"DIFFICULT PASSAGES",null,"BEHAVIOUR"]
[{"$f":"'00'!A16","v":0},null,null,{"$f":"IF(COUNT(E16:L16)=0,\"-\",E16+G16+I16+K16-C16)","v":0},{"$f":"'00'!E16","v":0},null,{"$f":"'00'!G16","v":0},null,{"$f":"'00'!I16","v":0},null,{"$f":"'00'!K16","v":0}]
[0,null,null,0,{"$f":"'00'!E17","v":0},null,{"$f":"'00'!G17","v":0},null,{"$f":"'00'!I17","v":0},null,{"$f":"'00'!K17","v":0}]
[{"$f":"'00'!A18","v":0},null,null,0,{"$f":"'00'!E18","v":0},null,{"$f":"'00'!G18","v":0},null,{"$f":"'00'!I18","v":0},null,{"$f":"'00'!K18","v":0}]
[{"$f":"'00'!A19","v":0},null,null,0,{"$f":"'00'!E19","v":0},null,{"$f":"'00'!G19","v":0},null,{"$f":"'00'!I19","v":0},null,{"$f":"'00'!K19","v":0}]
[{"$f":"'00'!A20","v":0},null,null,0,{"$f":"'00'!E20","v":0},null,{"$f":"'00'!G20","v":0},null,{"$f":"'00'!I20","v":0},null,{"$f":"'00'!K20","v":0}]
[{"$f":"'00'!A21","v":0},null,null,0,{"$f":"'00'!E21","v":0},null,{"$f":"'00'!G21","v":0},null,{"$f":"'00'!I21","v":0},null,{"$f":"'00'!K21","v":0}]
[{"$f":"'00'!A22","v":0},null,null,0,{"$f":"'00'!E22","v":0},null,{"$f":"'00'!G22","v":0},null,{"$f":"'00'!I22","v":0},null,{"$f":"'00'!K22","v":0}]
[{"$f":"'00'!A23","v":0},null,null,0,{"$f":"'00'!E23","v":0},null,{"$f":"'00'!G23","v":0},null,{"$f":"'00'!I23","v":0},null,{"$f":"'00'!K23","v":0}]
[{"$f":"'00'!A24","v":0},null,null,0,{"$f":"'00'!E24","v":0},null,{"$f":"'00'!G24","v":0},null,{"$f":"'00'!I24","v":0},null,{"$f":"'00'!K24","v":0}]
[{"$f":"'00'!A25","v":0},null,null,0,{"$f":"'00'!E25","v":0},null,{"$f":"'00'!G25","v":0},null,{"$f":"'00'!I25","v":0},null,{"$f":"'00'!K25","v":0}]
[{"$f":"'00'!A26","v":0},null,null,0,{"$f":"'00'!E26","v":0},null,{"$f":"'00'!G26","v":0},null,{"$f":"'00'!I26","v":0},null,{"$f":"'00'!K26","v":0}]
[{"$f":"'00'!A27","v":0},null,null,0,{"$f":"'00'!E27","v":0},null,{"$f":"'00'!G27","v":0},null,{"$f":"'00'!I27","v":0},null,{"$f":"'00'!K27","v":0}]
[{"$f":"'00'!A28","v":0},null,null,0,{"$f":"'00'!E28","v":0},null,{"$f":"'00'!G28","v":0},null,{"$f":"'00'!I28","v":0},null,{"$f":"'00'!K28","v":0}]
[{"$f":"'00'!A29","v":0},null,null,0,{"$f":"'00'!E29","v":0},null,{"$f":"'00'!G29","v":0},null,{"$f":"'00'!I29","v":0},null,{"$f":"'00'!K29","v":0}]
[{"$f":"'00'!A30","v":0},null,null,0,{"$f":"'00'!E30","v":0},null,{"$f":"'00'!G30","v":0},null,{"$f":"'00'!I30","v":0},null,{"$f":"'00'!K30","v":0}]
[{"$f":"'00'!A31","v":0},null,null,0,{"$f":"'00'!E31","v":0},null,{"$f":"'00'!G31","v":0},null,{"$f":"'00'!I31","v":0},null,{"$f":"'00'!K31","v":0}]
[{"$f":"'00'!A32","v":"Aptitude naturelle"},null,null,0,{"$f":"'00'!E32","v":0},null,{"$f":"'00'!G32","v":0},null,{"$f":"'00'!I32","v":0},null,{"$f":"'00'!K32","v":0}]
[{"$f":"'00'!A33","v":"Gentillesse"},null,null,0,{"$f":"'00'!E33","v":0},null,{"$f":"'00'!G33","v":0},null,{"$f":"'00'!I33","v":0},null,{"$f":"'00'!K33","v":0}]
[{"$f":"'00'!A34","v":"Intelligence de l'execution"},null,null,0,{"$f":"'00'!E34","v":0},null,{"$f":"'00'!G34","v":0},null,{"$f":"'00'!I34","v":0},null,{"$f":"'00'!K34","v":0}]
[{"$f":"'00'!A35","v":"Obéissance"},null,null,0,{"$f":"'00'!E35","v":0},null,{"$f":"'00'!G35","v":0},null,{"$f":"'00'!I35","v":0},null,{"$f":"'00'!K35","v":0}]
["POINTS TOTAL",null,{"$f":"SUM(C16:C35)","v":0},{"$f":"SUM(D16:D35)","v":0},{"$f":"'00'!E36","v":50},null,{"$f":"'00'!G36","v":30},null,{"$f":"'00'!I36","v":0},null,{"$f":"'00'!K36","v":20}]
["Détails des pénéalités ",null,null,"0","Pénalités en Négatif",null,null,null,"RANKING"]
[" POINTS",{"$f":"IF((C36)=0,\"-\",D36+D37)","v":"-"},{"$f":"IF(COUNT(D38:K38)=0,\"-\",D38+F38+H38+J38-B38)","v":"-"},"EVALUATION",null,{"$f":"$L$55","v":"-"},null,null,{"$f":"'Rapport de concours '!N22","v":"X"},null,null,{"$f":"COUNT(S17:S34)","v":0}]
["CACIT / RCACIT  / CACT  / RCACT  :",".",null," <== UPON JUDGE'S DECISION"]
["Observations :  ",null,null,null,null,null,null,null,null,null,null,null,null,null,null,null,0]
[]
[]
[]
[]
[null,null,null,null,null,null,null,null,null,null,null,null,null,null,null,null,48,"IHT1","GUARDING",null,35]
[null,null,null,null,null,null,null,null,null,null,null,null,null,null,null,null,49,"IHT1","MOVING",null,45]
[null,null,null,null,null,null,null,null,null,null,null,null,null,null,null,null,50,"IHT1","DIFFICULT PASS",null,10]
[null,null,null,null,null,null,null,null,null,null,null,null,null,null,null,null,51,"IHT1","BEHAVIOUR",null,10]
[null,null,null,null,null,null,null,null,null,null,null,null,null,null,null,null,52,"IHT2","GUARDING",null,35]
[null,null,null,null,null,null,null,null,null,null,null,null,null,null,null,null,53,"IHT2","MOVING",null,55]
[null,null,null,null,null,null,null,null,null,null,null,null,null,null,null,null,54,"IHT2","DIFFICULT PASS",null,20]
[null,null,null,null,null,null,null,null,null,null,null,null,null,null,null,null,55,"IHT2","BEHAVIOUR",null,10]
[null,null,null,null,null,null,null,null,null,null,null,null,null,null,null,null,56,"IHT3","GUARDING",null,40]
[null,null,null,null,null,null,null,null,null,null,null,null,null,null,null,null,57,"IHT3","MOVING",null,70]
[null,null,null,null,null,null,null,null,null,null,null,{"$f":"IF(B38=\"-\",\"-\",IF(B38>S58,\"EXCELLENT\",IF(B38>T58,\"TRES BON\",IF(B38>U58,\"BON\",IF(B38>V58,\"insuffisant\",IF(B37>0.1,\"insuffisant \",\"éliminé \"))))))","v":"-"},null,null,null,null,58,"IHT3","DIFFICULT PASS",null,30]
[null,null,null,null,null,null,null,null,null,null,null,null,null,null,null,null,59,"IHT3","BEHAVIOUR",null,10]
[]
[null,null,null,null,null,null,null,null,null,null,null,null,null,null,null,null,"IHT1",100,{"$f":"R58*89.999/100","v":89.998999999999995},{"$f":"R58*79.999/100","v":79.998999999999995},{"$f":"R58*69.999/100","v":69.998999999999995},{"$f":"R58*59.999/100","v":59.999000000000002},0.1]
[null,null,null,null,null,null,null,null,null,null,null,null,null,null,null,null,"iIHT2",120,{"$f":"R59*89.999/100","v":107.99879999999999},{"$f":"R59*79.999/100","v":95.998799999999989},{"$f":"R59*69.999/100","v":83.998799999999989},{"$f":"R59*59.999/100","v":71.998800000000003},0.1]
[null,null,null,null,null,null,null,null,null,null,null,null,null,null,null,null,"IHT3",150,134.99849999999998,{"$f":"R60*79.999/100","v":119.99849999999998},{"$f":"R60*69.999/100","v":104.99849999999998},{"$f":"R60*59.999/100","v":89.998500000000007},0.1]

{"sheet":"07","index":12,"n_rows":60,"n_cols":23,"rows_kept":60,"cut":false,"hidden":false,"merged":[[2,1,2,10],[4,6,4,8],[6,2,6,3],[6,4,6,10],[7,4,7,10],[8,2,8,3],[8,4,8,10],[13,0,13,1],[13,2,13,3],[13,4,13,5],[13,6,13,7],[13,8,13,9],[13,10,13,11],[9,2,9,3],[9,4,9,10],[10,2,10,3],[10,4,10,10],[11,2,11,3],[11,4,11,10],[14,4,14,5],[14,6,14,7],[14,8,14,9],[14,10,14,11],[15,4,15,5],[15,6,15,7],[15,8,15,9],[15,10,15,11],[12,4,12,10],[18,4,18,5],[18,6,18,7],[18,8,18,9],[18,10,18,11],[19,4,19,5],[19,6,19,7],[19,8,19,9],[19,10,19,11],[16,4,16,5],[16,6,16,7],[16,8,16,9],[16,10,16,11],[17,4,17,5],[17,6,17,7],[17,8,17,9],[17,10,17,11],[22,4,22,5],[22,6,22,7],[22,8,22,9],[22,10,22,11],[23,4,23,5],[23,6,23,7],[23,8,23,9],[23,10,23,11],[20,4,20,5],[20,6,20,7],[20,8,20,9],[20,10,20,11],[21,4,21,5],[21,6,21,7],[21,8,21,9],[21,10,21,11],[26,4,26,5],[26,6,26,7],[26,8,26,9],[26,10,26,11],[27,4,27,5],[27,6,27,7],[27,8,27,9],[27,10,27,11],[24,4,24,5],[24,6,24,7],[24,8,24,9],[24,10,24,11],[25,4,25,5],[25,6,25,7],[25,8,25,9],[25,10,25,11],[30,4,30,5],[30,6,30,7],[30,8,30,9],[30,10,30,11],[31,4,31,5],[31,6,31,7],[31,8,31,9],[31,10,31,11],[28,4,28,5],[28,6,28,7],[28,8,28,9],[28,10,28,11],[29,4,29,5],[29,6,29,7],[29,8,29,9],[29,10,29,11],[34,4,34,5],[34,6,34,7],[34,8,34,9],[34,10,34,11],[35,4,35,5],[35,6,35,7],[35,8,35,9],[35,10,35,11],[32,4,32,5],[32,6,32,7],[32,8,32,9],[32,10,32,11],[33,4,33,5],[33,6,33,7],[33,8,33,9],[33,10,33,11],[38,1,38,2],[38,3,38,11],[39,1,39,11],[44,18,44,19],[45,18,45,19],[46,18,46,19],[36,1,36,2],[36,4,36,7],[36,8,36,11],[37,1,37,2],[37,3,37,4],[37,5,37,7],[37,8,37,10],[53,18,53,19],[54,18,54,19],[55,18,55,19],[47,18,47,19],[48,18,48,19],[49,18,49,19],[50,18,50,19],[51,18,51,19],[52,18,52,19]]}
[null,null,null,null,null,null,"IHT TS","HWT"]
[]
[]
[]
[null,"IHT TS ",null,null,null,null,"COUNTRY LOGO"]
["Organisation",{"$f":"'Fiche organisateur N2'!F5","v":0}]
["Ville",{"$f":"'Fiche organisateur N2'!F6","v":0},"Date : ",null,{"$f":"'Fiche organisateur N2'!$H$8","v":0}]
["Contact : ",0]
["Propriètaire",{"$f":"'Fiche organisateur N2'!$C$23","v":0},"Race et sexe",null,{"$f":"'Fiche organisateur N2'!$G$23","v":0}]
["Conducteur",{"$f":"'Fiche organisateur N2'!$D$23","v":0},"Né",null,{"$f":"'Fiche organisateur N2'!$K$23","v":0}]
["Nom du chien",{"$f":"'Fiche organisateur N2'!$E$23","v":0},"PEDIGREE",null,{"$f":"'Fiche organisateur N2'!$J$23","v":0}]
["Affixe",{"$f":"'Fiche organisateur N2'!$F$23","v":0},"Identifiant ",null,{"$f":"'Fiche organisateur N2'!$L$23","v":0}]
[]
["for the country--->"]
["EXERCISES ","OBSERVATIONS","Mini","SCORE","GUARDING",null,"MOVING",null,"DIFFICULT PASSAGES",null,"BEHAVIOUR"]
[{"$f":"'00'!A16","v":0},null,null,{"$f":"IF(COUNT(E16:L16)=0,\"-\",E16+G16+I16+K16-C16)","v":0},{"$f":"'00'!E16","v":0},null,{"$f":"'00'!G16","v":0},null,{"$f":"'00'!I16","v":0},null,{"$f":"'00'!K16","v":0}]
[0,null,null,0,{"$f":"'00'!E17","v":0},null,{"$f":"'00'!G17","v":0},null,{"$f":"'00'!I17","v":0},null,{"$f":"'00'!K17","v":0}]
[{"$f":"'00'!A18","v":0},null,null,0,{"$f":"'00'!E18","v":0},null,{"$f":"'00'!G18","v":0},null,{"$f":"'00'!I18","v":0},null,{"$f":"'00'!K18","v":0}]
[{"$f":"'00'!A19","v":0},null,null,0,{"$f":"'00'!E19","v":0},null,{"$f":"'00'!G19","v":0},null,{"$f":"'00'!I19","v":0},null,{"$f":"'00'!K19","v":0}]
[{"$f":"'00'!A20","v":0},null,null,0,{"$f":"'00'!E20","v":0},null,{"$f":"'00'!G20","v":0},null,{"$f":"'00'!I20","v":0},null,{"$f":"'00'!K20","v":0}]
[{"$f":"'00'!A21","v":0},null,null,0,{"$f":"'00'!E21","v":0},null,{"$f":"'00'!G21","v":0},null,{"$f":"'00'!I21","v":0},null,{"$f":"'00'!K21","v":0}]
[{"$f":"'00'!A22","v":0},null,null,0,{"$f":"'00'!E22","v":0},null,{"$f":"'00'!G22","v":0},null,{"$f":"'00'!I22","v":0},null,{"$f":"'00'!K22","v":0}]
[{"$f":"'00'!A23","v":0},null,null,0,{"$f":"'00'!E23","v":0},null,{"$f":"'00'!G23","v":0},null,{"$f":"'00'!I23","v":0},null,{"$f":"'00'!K23","v":0}]
[{"$f":"'00'!A24","v":0},null,null,0,{"$f":"'00'!E24","v":0},null,{"$f":"'00'!G24","v":0},null,{"$f":"'00'!I24","v":0},null,{"$f":"'00'!K24","v":0}]
[{"$f":"'00'!A25","v":0},null,null,0,{"$f":"'00'!E25","v":0},null,{"$f":"'00'!G25","v":0},null,{"$f":"'00'!I25","v":0},null,{"$f":"'00'!K25","v":0}]
[{"$f":"'00'!A26","v":0},null,null,0,{"$f":"'00'!E26","v":0},null,{"$f":"'00'!G26","v":0},null,{"$f":"'00'!I26","v":0},null,{"$f":"'00'!K26","v":0}]
[{"$f":"'00'!A27","v":0},null,null,0,{"$f":"'00'!E27","v":0},null,{"$f":"'00'!G27","v":0},null,{"$f":"'00'!I27","v":0},null,{"$f":"'00'!K27","v":0}]
[{"$f":"'00'!A28","v":0},null,null,0,{"$f":"'00'!E28","v":0},null,{"$f":"'00'!G28","v":0},null,{"$f":"'00'!I28","v":0},null,{"$f":"'00'!K28","v":0}]
[{"$f":"'00'!A29","v":0},null,null,0,{"$f":"'00'!E29","v":0},null,{"$f":"'00'!G29","v":0},null,{"$f":"'00'!I29","v":0},null,{"$f":"'00'!K29","v":0}]
[{"$f":"'00'!A30","v":0},null,null,0,{"$f":"'00'!E30","v":0},null,{"$f":"'00'!G30","v":0},null,{"$f":"'00'!I30","v":0},null,{"$f":"'00'!K30","v":0}]
[{"$f":"'00'!A31","v":0},null,null,0,{"$f":"'00'!E31","v":0},null,{"$f":"'00'!G31","v":0},null,{"$f":"'00'!I31","v":0},null,{"$f":"'00'!K31","v":0}]
[{"$f":"'00'!A32","v":"Aptitude naturelle"},null,null,0,{"$f":"'00'!E32","v":0},null,{"$f":"'00'!G32","v":0},null,{"$f":"'00'!I32","v":0},null,{"$f":"'00'!K32","v":0}]
[{"$f":"'00'!A33","v":"Gentillesse"},null,null,0,{"$f":"'00'!E33","v":0},null,{"$f":"'00'!G33","v":0},null,{"$f":"'00'!I33","v":0},null,{"$f":"'00'!K33","v":0}]
[{"$f":"'00'!A34","v":"Intelligence de l'execution"},null,null,0,{"$f":"'00'!E34","v":0},null,{"$f":"'00'!G34","v":0},null,{"$f":"'00'!I34","v":0},null,{"$f":"'00'!K34","v":0}]
[{"$f":"'00'!A35","v":"Obéissance"},null,null,0,{"$f":"'00'!E35","v":0},null,{"$f":"'00'!G35","v":0},null,{"$f":"'00'!I35","v":0},null,{"$f":"'00'!K35","v":0}]
["POINTS TOTAL",null,{"$f":"SUM(C16:C35)","v":0},{"$f":"SUM(D16:D35)","v":0},{"$f":"'00'!E36","v":50},null,{"$f":"'00'!G36","v":30},null,{"$f":"'00'!I36","v":0},null,{"$f":"'00'!K36","v":20}]
["Détails des pénéalités ",null,null,"0","Pénalités en Négatif",null,null,null,"RANKING"]
[" POINTS",{"$f":"IF((C36)=0,\"-\",D36+D37)","v":"-"},{"$f":"IF(COUNT(D38:K38)=0,\"-\",D38+F38+H38+J38-B38)","v":"-"},"EVALUATION",null,{"$f":"$L$55","v":"-"},null,null,{"$f":"'Rapport de concours '!N23","v":"X"},null,null,{"$f":"COUNT(S17:S34)","v":0}]
["CACIT / RCACIT  / CACT  / RCACT  :",".",null," <== UPON JUDGE'S DECISION"]
["Observations :  ",null,null,null,null,null,null,null,null,null,null,null,null,null,null,null,0]
[]
[]
[]
[]
[null,null,null,null,null,null,null,null,null,null,null,null,null,null,null,null,48,"IHT1","GUARDING",null,35]
[null,null,null,null,null,null,null,null,null,null,null,null,null,null,null,null,49,"IHT1","MOVING",null,45]
[null,null,null,null,null,null,null,null,null,null,null,null,null,null,null,null,50,"IHT1","DIFFICULT PASS",null,10]
[null,null,null,null,null,null,null,null,null,null,null,null,null,null,null,null,51,"IHT1","BEHAVIOUR",null,10]
[null,null,null,null,null,null,null,null,null,null,null,null,null,null,null,null,52,"IHT2","GUARDING",null,35]
[null,null,null,null,null,null,null,null,null,null,null,null,null,null,null,null,53,"IHT2","MOVING",null,55]
[null,null,null,null,null,null,null,null,null,null,null,null,null,null,null,null,54,"IHT2","DIFFICULT PASS",null,20]
[null,null,null,null,null,null,null,null,null,null,null,null,null,null,null,null,55,"IHT2","BEHAVIOUR",null,10]
[null,null,null,null,null,null,null,null,null,null,null,null,null,null,null,null,56,"IHT3","GUARDING",null,40]
[null,null,null,null,null,null,null,null,null,null,null,null,null,null,null,null,57,"IHT3","MOVING",null,70]
[null,null,null,null,null,null,null,null,null,null,null,{"$f":"IF(B38=\"-\",\"-\",IF(B38>S58,\"EXCELLENT\",IF(B38>T58,\"TRES BON\",IF(B38>U58,\"BON\",IF(B38>V58,\"insuffisant\",IF(B37>0.1,\"insuffisant \",\"éliminé \"))))))","v":"-"},null,null,null,null,58,"IHT3","DIFFICULT PASS",null,30]
[null,null,null,null,null,null,null,null,null,null,null,null,null,null,null,null,59,"IHT3","BEHAVIOUR",null,10]
[]
[null,null,null,null,null,null,null,null,null,null,null,null,null,null,null,null,"IHT1",100,{"$f":"R58*89.999/100","v":89.998999999999995},{"$f":"R58*79.999/100","v":79.998999999999995},{"$f":"R58*69.999/100","v":69.998999999999995},{"$f":"R58*59.999/100","v":59.999000000000002},0.1]
[null,null,null,null,null,null,null,null,null,null,null,null,null,null,null,null,"iIHT2",120,{"$f":"R59*89.999/100","v":107.99879999999999},{"$f":"R59*79.999/100","v":95.998799999999989},{"$f":"R59*69.999/100","v":83.998799999999989},{"$f":"R59*59.999/100","v":71.998800000000003},0.1]
[null,null,null,null,null,null,null,null,null,null,null,null,null,null,null,null,"IHT3",150,134.99849999999998,{"$f":"R60*79.999/100","v":119.99849999999998},{"$f":"R60*69.999/100","v":104.99849999999998},{"$f":"R60*59.999/100","v":89.998500000000007},0.1]

{"sheet":"08","index":13,"n_rows":60,"n_cols":23,"rows_kept":60,"cut":false,"hidden":false,"merged":[[15,8,15,9],[15,10,15,11],[12,4,12,10],[2,1,2,10],[4,6,4,8],[6,2,6,3],[6,4,6,10],[7,4,7,10],[8,2,8,3],[8,4,8,10],[13,0,13,1],[13,2,13,3],[13,4,13,5],[13,6,13,7],[13,8,13,9],[13,10,13,11],[9,2,9,3],[9,4,9,10],[10,2,10,3],[10,4,10,10],[11,2,11,3],[11,4,11,10],[14,4,14,5],[14,6,14,7],[19,6,19,7],[19,8,19,9],[19,10,19,11],[16,4,16,5],[16,6,16,7],[16,8,16,9],[16,10,16,11],[17,4,17,5],[17,6,17,7],[17,8,17,9],[17,10,17,11],[14,8,14,9],[14,10,14,11],[15,6,15,7],[22,4,22,5],[22,6,22,7],[22,8,22,9],[22,10,22,11],[23,4,23,5],[23,6,23,7],[23,8,23,9],[23,10,23,11],[20,4,20,5],[20,6,20,7],[20,8,20,9],[20,10,20,11],[21,4,21,5],[21,6,21,7],[21,8,21,9],[21,10,21,11],[18,4,18,5],[18,6,18,7],[18,8,18,9],[18,10,18,11],[19,4,19,5],[26,4,26,5],[26,6,26,7],[26,8,26,9],[26,10,26,11],[27,4,27,5],[27,6,27,7],[27,8,27,9],[27,10,27,11],[24,4,24,5],[24,6,24,7],[24,8,24,9],[24,10,24,11],[25,4,25,5],[25,6,25,7],[25,8,25,9],[25,10,25,11],[30,4,30,5],[30,6,30,7],[30,8,30,9],[30,10,30,11],[31,4,31,5],[31,6,31,7],[31,8,31,9],[31,10,31,11],[28,4,28,5],[28,6,28,7],[28,8,28,9],[28,10,28,11],[29,4,29,5],[29,6,29,7],[29,8,29,9],[29,10,29,11],[34,4,34,5],[34,6,34,7],[34,8,34,9],[34,10,34,11],[35,4,35,5],[35,6,35,7],[35,8,35,9],[35,10,35,11],[32,4,32,5],[32,6,32,7],[32,8,32,9],[32,10,32,11],[33,4,33,5],[33,6,33,7],[33,8,33,9],[33,10,33,11],[38,1,38,2],[38,3,38,11],[39,1,39,11],[44,18,44,19],[45,18,45,19],[46,18,46,19],[36,1,36,2],[36,4,36,7],[36,8,36,11],[37,1,37,2],[37,3,37,4],[37,5,37,7],[37,8,37,10],[53,18,53,19],[54,18,54,19],[55,18,55,19],[47,18,47,19],[48,18,48,19],[49,18,49,19],[50,18,50,19],[51,18,51,19],[52,18,52,19]]}
[null,null,null,null,null,null,"IHT TS","HWT"]
[]
[]
[]
[null,"IHT TS ",null,null,null,null,"COUNTRY LOGO"]
["Organisation",{"$f":"'Fiche organisateur N2'!F5","v":0}]
["Ville",{"$f":"'Fiche organisateur N2'!F6","v":0},"Date : ",null,{"$f":"'Fiche organisateur N2'!$H$8","v":0}]
["Contact : ",0]
["Propriètaire",{"$f":"'Fiche organisateur N2'!$C$24","v":0},"Race et sexe",null,{"$f":"'Fiche organisateur N2'!$G$24","v":0}]
["Conducteur",{"$f":"'Fiche organisateur N2'!$D$24","v":0},"Né",null,{"$f":"'Fiche organisateur N2'!$K$24","v":0}]
["Nom du chien",{"$f":"'Fiche organisateur N2'!$E$24","v":0},"PEDIGREE",null,{"$f":"'Fiche organisateur N2'!$J$24","v":0}]
["Affixe",{"$f":"'Fiche organisateur N2'!$F$24","v":0},"Identifiant ",null,{"$f":"'Fiche organisateur N2'!$L$24","v":0}]
[]
["for the country--->"]
["EXERCISES ","OBSERVATIONS","Mini","SCORE","GUARDING",null,"MOVING",null,"DIFFICULT PASSAGES",null,"BEHAVIOUR"]
[{"$f":"'00'!A16","v":0},null,null,{"$f":"IF(COUNT(E16:L16)=0,\"-\",E16+G16+I16+K16-C16)","v":0},{"$f":"'00'!E16","v":0},null,{"$f":"'00'!G16","v":0},null,{"$f":"'00'!I16","v":0},null,{"$f":"'00'!K16","v":0}]
[0,null,null,0,{"$f":"'00'!E17","v":0},null,{"$f":"'00'!G17","v":0},null,{"$f":"'00'!I17","v":0},null,{"$f":"'00'!K17","v":0}]
[{"$f":"'00'!A18","v":0},null,null,0,{"$f":"'00'!E18","v":0},null,{"$f":"'00'!G18","v":0},null,{"$f":"'00'!I18","v":0},null,{"$f":"'00'!K18","v":0}]
[{"$f":"'00'!A19","v":0},null,null,0,{"$f":"'00'!E19","v":0},null,{"$f":"'00'!G19","v":0},null,{"$f":"'00'!I19","v":0},null,{"$f":"'00'!K19","v":0}]
[{"$f":"'00'!A20","v":0},null,null,0,{"$f":"'00'!E20","v":0},null,{"$f":"'00'!G20","v":0},null,{"$f":"'00'!I20","v":0},null,{"$f":"'00'!K20","v":0}]
[{"$f":"'00'!A21","v":0},null,null,0,{"$f":"'00'!E21","v":0},null,{"$f":"'00'!G21","v":0},null,{"$f":"'00'!I21","v":0},null,{"$f":"'00'!K21","v":0}]
[{"$f":"'00'!A22","v":0},null,null,0,{"$f":"'00'!E22","v":0},null,{"$f":"'00'!G22","v":0},null,{"$f":"'00'!I22","v":0},null,{"$f":"'00'!K22","v":0}]
[{"$f":"'00'!A23","v":0},null,null,0,{"$f":"'00'!E23","v":0},null,{"$f":"'00'!G23","v":0},null,{"$f":"'00'!I23","v":0},null,{"$f":"'00'!K23","v":0}]
[{"$f":"'00'!A24","v":0},null,null,0,{"$f":"'00'!E24","v":0},null,{"$f":"'00'!G24","v":0},null,{"$f":"'00'!I24","v":0},null,{"$f":"'00'!K24","v":0}]
[{"$f":"'00'!A25","v":0},null,null,0,{"$f":"'00'!E25","v":0},null,{"$f":"'00'!G25","v":0},null,{"$f":"'00'!I25","v":0},null,{"$f":"'00'!K25","v":0}]
[{"$f":"'00'!A26","v":0},null,null,0,{"$f":"'00'!E26","v":0},null,{"$f":"'00'!G26","v":0},null,{"$f":"'00'!I26","v":0},null,{"$f":"'00'!K26","v":0}]
[{"$f":"'00'!A27","v":0},null,null,0,{"$f":"'00'!E27","v":0},null,{"$f":"'00'!G27","v":0},null,{"$f":"'00'!I27","v":0},null,{"$f":"'00'!K27","v":0}]
[{"$f":"'00'!A28","v":0},null,null,0,{"$f":"'00'!E28","v":0},null,{"$f":"'00'!G28","v":0},null,{"$f":"'00'!I28","v":0},null,{"$f":"'00'!K28","v":0}]
[{"$f":"'00'!A29","v":0},null,null,0,{"$f":"'00'!E29","v":0},null,{"$f":"'00'!G29","v":0},null,{"$f":"'00'!I29","v":0},null,{"$f":"'00'!K29","v":0}]
[{"$f":"'00'!A30","v":0},null,null,0,{"$f":"'00'!E30","v":0},null,{"$f":"'00'!G30","v":0},null,{"$f":"'00'!I30","v":0},null,{"$f":"'00'!K30","v":0}]
[{"$f":"'00'!A31","v":0},null,null,0,{"$f":"'00'!E31","v":0},null,{"$f":"'00'!G31","v":0},null,{"$f":"'00'!I31","v":0},null,{"$f":"'00'!K31","v":0}]
[{"$f":"'00'!A32","v":"Aptitude naturelle"},null,null,0,{"$f":"'00'!E32","v":0},null,{"$f":"'00'!G32","v":0},null,{"$f":"'00'!I32","v":0},null,{"$f":"'00'!K32","v":0}]
[{"$f":"'00'!A33","v":"Gentillesse"},null,null,0,{"$f":"'00'!E33","v":0},null,{"$f":"'00'!G33","v":0},null,{"$f":"'00'!I33","v":0},null,{"$f":"'00'!K33","v":0}]
[{"$f":"'00'!A34","v":"Intelligence de l'execution"},null,null,0,{"$f":"'00'!E34","v":0},null,{"$f":"'00'!G34","v":0},null,{"$f":"'00'!I34","v":0},null,{"$f":"'00'!K34","v":0}]
[{"$f":"'00'!A35","v":"Obéissance"},null,null,0,{"$f":"'00'!E35","v":0},null,{"$f":"'00'!G35","v":0},null,{"$f":"'00'!I35","v":0},null,{"$f":"'00'!K35","v":0}]
["POINTS TOTAL",null,{"$f":"SUM(C16:C35)","v":0},{"$f":"SUM(D16:D35)","v":0},{"$f":"'00'!E36","v":50},null,{"$f":"'00'!G36","v":30},null,{"$f":"'00'!I36","v":0},null,{"$f":"'00'!K36","v":20}]
["Détails des pénéalités ",null,null,"0","Pénalités en Négatif",null,null,null,"RANKING"]
[" POINTS",{"$f":"IF((C36)=0,\"-\",D36+D37)","v":"-"},{"$f":"IF(COUNT(D38:K38)=0,\"-\",D38+F38+H38+J38-B38)","v":"-"},"EVALUATION",null,{"$f":"$L$55","v":"-"},null,null,{"$f":"'Rapport de concours '!N24","v":"X"},null,null,{"$f":"COUNT(S17:S34)","v":0}]
["CACIT / RCACIT  / CACT  / RCACT  :",".",null," <== UPON JUDGE'S DECISION"]
["Observations :  ",null,null,null,null,null,null,null,null,null,null,null,null,null,null,null,0]
[]
[]
[]
[]
[null,null,null,null,null,null,null,null,null,null,null,null,null,null,null,null,48,"IHT1","GUARDING",null,35]
[null,null,null,null,null,null,null,null,null,null,null,null,null,null,null,null,49,"IHT1","MOVING",null,45]
[null,null,null,null,null,null,null,null,null,null,null,null,null,null,null,null,50,"IHT1","DIFFICULT PASS",null,10]
[null,null,null,null,null,null,null,null,null,null,null,null,null,null,null,null,51,"IHT1","BEHAVIOUR",null,10]
[null,null,null,null,null,null,null,null,null,null,null,null,null,null,null,null,52,"IHT2","GUARDING",null,35]
[null,null,null,null,null,null,null,null,null,null,null,null,null,null,null,null,53,"IHT2","MOVING",null,55]
[null,null,null,null,null,null,null,null,null,null,null,null,null,null,null,null,54,"IHT2","DIFFICULT PASS",null,20]
[null,null,null,null,null,null,null,null,null,null,null,null,null,null,null,null,55,"IHT2","BEHAVIOUR",null,10]
[null,null,null,null,null,null,null,null,null,null,null,null,null,null,null,null,56,"IHT3","GUARDING",null,40]
[null,null,null,null,null,null,null,null,null,null,null,null,null,null,null,null,57,"IHT3","MOVING",null,70]
[null,null,null,null,null,null,null,null,null,null,null,{"$f":"IF(B38=\"-\",\"-\",IF(B38>S58,\"EXCELLENT\",IF(B38>T58,\"TRES BON\",IF(B38>U58,\"BON\",IF(B38>V58,\"insuffisant\",IF(B37>0.1,\"insuffisant \",\"éliminé \"))))))","v":"-"},null,null,null,null,58,"IHT3","DIFFICULT PASS",null,30]
[null,null,null,null,null,null,null,null,null,null,null,null,null,null,null,null,59,"IHT3","BEHAVIOUR",null,10]
[]
[null,null,null,null,null,null,null,null,null,null,null,null,null,null,null,null,"IHT1",100,{"$f":"R58*89.999/100","v":89.998999999999995},{"$f":"R58*79.999/100","v":79.998999999999995},{"$f":"R58*69.999/100","v":69.998999999999995},{"$f":"R58*59.999/100","v":59.999000000000002},0.1]
[null,null,null,null,null,null,null,null,null,null,null,null,null,null,null,null,"iIHT2",120,{"$f":"R59*89.999/100","v":107.99879999999999},{"$f":"R59*79.999/100","v":95.998799999999989},{"$f":"R59*69.999/100","v":83.998799999999989},{"$f":"R59*59.999/100","v":71.998800000000003},0.1]
[null,null,null,null,null,null,null,null,null,null,null,null,null,null,null,null,"IHT3",150,134.99849999999998,{"$f":"R60*79.999/100","v":119.99849999999998},{"$f":"R60*69.999/100","v":104.99849999999998},{"$f":"R60*59.999/100","v":89.998500000000007},0.1]

{"sheet":"09","index":14,"n_rows":60,"n_cols":23,"rows_kept":60,"cut":false,"hidden":false,"merged":[[2,1,2,10],[4,6,4,8],[6,2,6,3],[6,4,6,10],[7,4,7,10],[8,2,8,3],[8,4,8,10],[13,0,13,1],[13,2,13,3],[13,4,13,5],[13,6,13,7],[13,8,13,9],[13,10,13,11],[9,2,9,3],[9,4,9,10],[10,2,10,3],[10,4,10,10],[11,2,11,3],[11,4,11,10],[14,4,14,5],[14,6,14,7],[14,8,14,9],[14,10,14,11],[15,4,15,5],[15,6,15,7],[15,8,15,9],[15,10,15,11],[12,4,12,10],[18,4,18,5],[18,6,18,7],[18,8,18,9],[18,10,18,11],[19,4,19,5],[19,6,19,7],[19,8,19,9],[19,10,19,11],[16,4,16,5],[16,6,16,7],[16,8,16,9],[16,10,16,11],[17,4,17,5],[17,6,17,7],[17,8,17,9],[17,10,17,11],[22,4,22,5],[22,6,22,7],[22,8,22,9],[22,10,22,11],[23,4,23,5],[23,6,23,7],[23,8,23,9],[23,10,23,11],[20,4,20,5],[20,6,20,7],[20,8,20,9],[20,10,20,11],[21,4,21,5],[21,6,21,7],[21,8,21,9],[21,10,21,11],[26,4,26,5],[26,6,26,7],[26,8,26,9],[26,10,26,11],[27,4,27,5],[27,6,27,7],[27,8,27,9],[27,10,27,11],[24,4,24,5],[24,6,24,7],[24,8,24,9],[24,10,24,11],[25,4,25,5],[25,6,25,7],[25,8,25,9],[25,10,25,11],[30,4,30,5],[30,6,30,7],[30,8,30,9],[30,10,30,11],[31,4,31,5],[31,6,31,7],[31,8,31,9],[31,10,31,11],[28,4,28,5],[28,6,28,7],[28,8,28,9],[28,10,28,11],[29,4,29,5],[29,6,29,7],[29,8,29,9],[29,10,29,11],[34,4,34,5],[34,6,34,7],[34,8,34,9],[34,10,34,11],[35,4,35,5],[35,6,35,7],[35,8,35,9],[35,10,35,11],[32,4,32,5],[32,6,32,7],[32,8,32,9],[32,10,32,11],[33,4,33,5],[33,6,33,7],[33,8,33,9],[33,10,33,11],[38,1,38,2],[38,3,38,11],[39,1,39,11],[44,18,44,19],[45,18,45,19],[46,18,46,19],[36,1,36,2],[36,4,36,7],[36,8,36,11],[37,1,37,2],[37,3,37,4],[37,5,37,7],[37,8,37,10],[53,18,53,19],[54,18,54,19],[55,18,55,19],[47,18,47,19],[48,18,48,19],[49,18,49,19],[50,18,50,19],[51,18,51,19],[52,18,52,19]]}
[null,null,null,null,null,null,"IHT TS","HWT"]
[]
[]
[]
[null,"IHT TS ",null,null,null,null,"COUNTRY LOGO"]
["Organisation",{"$f":"'Fiche organisateur N2'!F5","v":0}]
["Ville",{"$f":"'Fiche organisateur N2'!F6","v":0},"Date : ",null,{"$f":"'Fiche organisateur N2'!$H$8","v":0}]
["Contact : ",0]
["Propriètaire",{"$f":"'Fiche organisateur N2'!$C$25","v":0},"Race et sexe",null,{"$f":"'Fiche organisateur N2'!$G$25","v":0}]
["Conducteur",{"$f":"'Fiche organisateur N2'!$D$25","v":0},"Né",null,{"$f":"'Fiche organisateur N2'!$K$25","v":0}]
["Nom du chien",{"$f":"'Fiche organisateur N2'!$E$25","v":0},"PEDIGREE",null,{"$f":"'Fiche organisateur N2'!$J$25","v":0}]
["Affixe",{"$f":"'Fiche organisateur N2'!$F$25","v":0},"Identifiant ",null,{"$f":"'Fiche organisateur N2'!$L$25","v":0}]
[]
["for the country--->"]
["EXERCISES ","OBSERVATIONS","Mini","SCORE","GUARDING",null,"MOVING",null,"DIFFICULT PASSAGES",null,"BEHAVIOUR"]
[{"$f":"'00'!A16","v":0},null,null,{"$f":"IF(COUNT(E16:L16)=0,\"-\",E16+G16+I16+K16-C16)","v":0},{"$f":"'00'!E16","v":0},null,{"$f":"'00'!G16","v":0},null,{"$f":"'00'!I16","v":0},null,{"$f":"'00'!K16","v":0}]
[0,null,null,0,{"$f":"'00'!E17","v":0},null,{"$f":"'00'!G17","v":0},null,{"$f":"'00'!I17","v":0},null,{"$f":"'00'!K17","v":0}]
[{"$f":"'00'!A18","v":0},null,null,0,{"$f":"'00'!E18","v":0},null,{"$f":"'00'!G18","v":0},null,{"$f":"'00'!I18","v":0},null,{"$f":"'00'!K18","v":0}]
[{"$f":"'00'!A19","v":0},null,null,0,{"$f":"'00'!E19","v":0},null,{"$f":"'00'!G19","v":0},null,{"$f":"'00'!I19","v":0},null,{"$f":"'00'!K19","v":0}]
[{"$f":"'00'!A20","v":0},null,null,0,{"$f":"'00'!E20","v":0},null,{"$f":"'00'!G20","v":0},null,{"$f":"'00'!I20","v":0},null,{"$f":"'00'!K20","v":0}]
[{"$f":"'00'!A21","v":0},null,null,0,{"$f":"'00'!E21","v":0},null,{"$f":"'00'!G21","v":0},null,{"$f":"'00'!I21","v":0},null,{"$f":"'00'!K21","v":0}]
[{"$f":"'00'!A22","v":0},null,null,0,{"$f":"'00'!E22","v":0},null,{"$f":"'00'!G22","v":0},null,{"$f":"'00'!I22","v":0},null,{"$f":"'00'!K22","v":0}]
[{"$f":"'00'!A23","v":0},null,null,0,{"$f":"'00'!E23","v":0},null,{"$f":"'00'!G23","v":0},null,{"$f":"'00'!I23","v":0},null,{"$f":"'00'!K23","v":0}]
[{"$f":"'00'!A24","v":0},null,null,0,{"$f":"'00'!E24","v":0},null,{"$f":"'00'!G24","v":0},null,{"$f":"'00'!I24","v":0},null,{"$f":"'00'!K24","v":0}]
[{"$f":"'00'!A25","v":0},null,null,0,{"$f":"'00'!E25","v":0},null,{"$f":"'00'!G25","v":0},null,{"$f":"'00'!I25","v":0},null,{"$f":"'00'!K25","v":0}]
[{"$f":"'00'!A26","v":0},null,null,0,{"$f":"'00'!E26","v":0},null,{"$f":"'00'!G26","v":0},null,{"$f":"'00'!I26","v":0},null,{"$f":"'00'!K26","v":0}]
[{"$f":"'00'!A27","v":0},null,null,0,{"$f":"'00'!E27","v":0},null,{"$f":"'00'!G27","v":0},null,{"$f":"'00'!I27","v":0},null,{"$f":"'00'!K27","v":0}]
[{"$f":"'00'!A28","v":0},null,null,0,{"$f":"'00'!E28","v":0},null,{"$f":"'00'!G28","v":0},null,{"$f":"'00'!I28","v":0},null,{"$f":"'00'!K28","v":0}]
[{"$f":"'00'!A29","v":0},null,null,0,{"$f":"'00'!E29","v":0},null,{"$f":"'00'!G29","v":0},null,{"$f":"'00'!I29","v":0},null,{"$f":"'00'!K29","v":0}]
[{"$f":"'00'!A30","v":0},null,null,0,{"$f":"'00'!E30","v":0},null,{"$f":"'00'!G30","v":0},null,{"$f":"'00'!I30","v":0},null,{"$f":"'00'!K30","v":0}]
[{"$f":"'00'!A31","v":0},null,null,0,{"$f":"'00'!E31","v":0},null,{"$f":"'00'!G31","v":0},null,{"$f":"'00'!I31","v":0},null,{"$f":"'00'!K31","v":0}]
[{"$f":"'00'!A32","v":"Aptitude naturelle"},null,null,0,{"$f":"'00'!E32","v":0},null,{"$f":"'00'!G32","v":0},null,{"$f":"'00'!I32","v":0},null,{"$f":"'00'!K32","v":0}]
[{"$f":"'00'!A33","v":"Gentillesse"},null,null,0,{"$f":"'00'!E33","v":0},null,{"$f":"'00'!G33","v":0},null,{"$f":"'00'!I33","v":0},null,{"$f":"'00'!K33","v":0}]
[{"$f":"'00'!A34","v":"Intelligence de l'execution"},null,null,0,{"$f":"'00'!E34","v":0},null,{"$f":"'00'!G34","v":0},null,{"$f":"'00'!I34","v":0},null,{"$f":"'00'!K34","v":0}]
[{"$f":"'00'!A35","v":"Obéissance"},null,null,0,{"$f":"'00'!E35","v":0},null,{"$f":"'00'!G35","v":0},null,{"$f":"'00'!I35","v":0},null,{"$f":"'00'!K35","v":0}]
["POINTS TOTAL",null,{"$f":"SUM(C16:C35)","v":0},{"$f":"SUM(D16:D35)","v":0},{"$f":"'00'!E36","v":50},null,{"$f":"'00'!G36","v":30},null,{"$f":"'00'!I36","v":0},null,{"$f":"'00'!K36","v":20}]
["Détails des pénéalités ",null,null,"0","Pénalités en Négatif",null,null,null,"RANKING"]
[" POINTS",{"$f":"IF((C36)=0,\"-\",D36+D37)","v":"-"},{"$f":"IF(COUNT(D38:K38)=0,\"-\",D38+F38+H38+J38-B38)","v":"-"},"EVALUATION",null,{"$f":"$L$55","v":"-"},null,null,{"$f":"'Rapport de concours '!N25","v":"X"},null,null,{"$f":"COUNT(S17:S34)","v":0}]
["CACIT / RCACIT  / CACT  / RCACT  :",".",null," <== UPON JUDGE'S DECISION"]
["Observations :  ",null,null,null,null,null,null,null,null,null,null,null,null,null,null,null,0]
[]
[]
[]
[]
[null,null,null,null,null,null,null,null,null,null,null,null,null,null,null,null,48,"IHT1","GUARDING",null,35]
[null,null,null,null,null,null,null,null,null,null,null,null,null,null,null,null,49,"IHT1","MOVING",null,45]
[null,null,null,null,null,null,null,null,null,null,null,null,null,null,null,null,50,"IHT1","DIFFICULT PASS",null,10]
[null,null,null,null,null,null,null,null,null,null,null,null,null,null,null,null,51,"IHT1","BEHAVIOUR",null,10]
[null,null,null,null,null,null,null,null,null,null,null,null,null,null,null,null,52,"IHT2","GUARDING",null,35]
[null,null,null,null,null,null,null,null,null,null,null,null,null,null,null,null,53,"IHT2","MOVING",null,55]
[null,null,null,null,null,null,null,null,null,null,null,null,null,null,null,null,54,"IHT2","DIFFICULT PASS",null,20]
[null,null,null,null,null,null,null,null,null,null,null,null,null,null,null,null,55,"IHT2","BEHAVIOUR",null,10]
[null,null,null,null,null,null,null,null,null,null,null,null,null,null,null,null,56,"IHT3","GUARDING",null,40]
[null,null,null,null,null,null,null,null,null,null,null,null,null,null,null,null,57,"IHT3","MOVING",null,70]
[null,null,null,null,null,null,null,null,null,null,null,{"$f":"IF(B38=\"-\",\"-\",IF(B38>S58,\"EXCELLENT\",IF(B38>T58,\"TRES BON\",IF(B38>U58,\"BON\",IF(B38>V58,\"insuffisant\",IF(B37>0.1,\"insuffisant \",\"éliminé \"))))))","v":"-"},null,null,null,null,58,"IHT3","DIFFICULT PASS",null,30]
[null,null,null,null,null,null,null,null,null,null,null,null,null,null,null,null,59,"IHT3","BEHAVIOUR",null,10]
[]
[null,null,null,null,null,null,null,null,null,null,null,null,null,null,null,null,"IHT1",100,{"$f":"R58*89.999/100","v":89.998999999999995},{"$f":"R58*79.999/100","v":79.998999999999995},{"$f":"R58*69.999/100","v":69.998999999999995},{"$f":"R58*59.999/100","v":59.999000000000002},0.1]
[null,null,null,null,null,null,null,null,null,null,null,null,null,null,null,null,"iIHT2",120,{"$f":"R59*89.999/100","v":107.99879999999999},{"$f":"R59*79.999/100","v":95.998799999999989},{"$f":"R59*69.999/100","v":83.998799999999989},{"$f":"R59*59.999/100","v":71.998800000000003},0.1]
[null,null,null,null,null,null,null,null,null,null,null,null,null,null,null,null,"IHT3",150,134.99849999999998,{"$f":"R60*79.999/100","v":119.99849999999998},{"$f":"R60*69.999/100","v":104.99849999999998},{"$f":"R60*59.999/100","v":89.998500000000007},0.1]

{"sheet":"10","index":15,"n_rows":60,"n_cols":23,"rows_kept":60,"cut":false,"hidden":false,"merged":[[2,1,2,10],[4,6,4,8],[6,2,6,3],[6,4,6,10],[7,4,7,10],[8,2,8,3],[8,4,8,10],[13,0,13,1],[13,2,13,3],[13,4,13,5],[13,6,13,7],[13,8,13,9],[13,10,13,11],[9,2,9,3],[9,4,9,10],[10,2,10,3],[10,4,10,10],[11,2,11,3],[11,4,11,10],[14,4,14,5],[14,6,14,7],[14,8,14,9],[14,10,14,11],[15,4,15,5],[15,6,15,7],[15,8,15,9],[15,10,15,11],[12,4,12,10],[18,4,18,5],[18,6,18,7],[18,8,18,9],[18,10,18,11],[19,4,19,5],[19,6,19,7],[19,8,19,9],[19,10,19,11],[16,4,16,5],[16,6,16,7],[16,8,16,9],[16,10,16,11],[17,4,17,5],[17,6,17,7],[17,8,17,9],[17,10,17,11],[22,4,22,5],[22,6,22,7],[22,8,22,9],[22,10,22,11],[23,4,23,5],[23,6,23,7],[23,8,23,9],[23,10,23,11],[20,4,20,5],[20,6,20,7],[20,8,20,9],[20,10,20,11],[21,4,21,5],[21,6,21,7],[21,8,21,9],[21,10,21,11],[26,4,26,5],[26,6,26,7],[26,8,26,9],[26,10,26,11],[27,4,27,5],[27,6,27,7],[27,8,27,9],[27,10,27,11],[24,4,24,5],[24,6,24,7],[24,8,24,9],[24,10,24,11],[25,4,25,5],[25,6,25,7],[25,8,25,9],[25,10,25,11],[30,4,30,5],[30,6,30,7],[30,8,30,9],[30,10,30,11],[31,4,31,5],[31,6,31,7],[31,8,31,9],[31,10,31,11],[28,4,28,5],[28,6,28,7],[28,8,28,9],[28,10,28,11],[29,4,29,5],[29,6,29,7],[29,8,29,9],[29,10,29,11],[34,4,34,5],[34,6,34,7],[34,8,34,9],[34,10,34,11],[35,4,35,5],[35,6,35,7],[35,8,35,9],[35,10,35,11],[32,4,32,5],[32,6,32,7],[32,8,32,9],[32,10,32,11],[33,4,33,5],[33,6,33,7],[33,8,33,9],[33,10,33,11],[38,1,38,2],[38,3,38,11],[39,1,39,11],[44,18,44,19],[45,18,45,19],[46,18,46,19],[36,1,36,2],[36,4,36,7],[36,8,36,11],[37,1,37,2],[37,3,37,4],[37,5,37,7],[37,8,37,10],[53,18,53,19],[54,18,54,19],[55,18,55,19],[47,18,47,19],[48,18,48,19],[49,18,49,19],[50,18,50,19],[51,18,51,19],[52,18,52,19]]}
[null,null,null,null,null,null,"IHT TS","HWT"]
[]
[]
[]
[null,"IHT TS ",null,null,null,null,"COUNTRY LOGO"]
["Organisation",{"$f":"'Fiche organisateur N2'!F5","v":0}]
["Ville",{"$f":"'Fiche organisateur N2'!F6","v":0},"Date : ",null,{"$f":"'Fiche organisateur N2'!$H$8","v":0}]
["Contact : ",0]
["Propriètaire",{"$f":"'Fiche organisateur N2'!$C$26","v":0},"Race et sexe",null,{"$f":"'Fiche organisateur N2'!$G$26","v":0}]
["Conducteur",{"$f":"'Fiche organisateur N2'!$D$26","v":0},"Né",null,{"$f":"'Fiche organisateur N2'!$K$26","v":0}]
["Nom du chien",{"$f":"'Fiche organisateur N2'!$E$26","v":0},"PEDIGREE",null,{"$f":"'Fiche organisateur N2'!$J$17","v":0}]
["Affixe",{"$f":"'Fiche organisateur N2'!$F$26","v":0},"Identifiant ",null,{"$f":"'Fiche organisateur N2'!$L$17","v":0}]
[]
["for the country--->"]
["EXERCISES ","OBSERVATIONS","Mini","SCORE","GUARDING",null,"MOVING",null,"DIFFICULT PASSAGES",null,"BEHAVIOUR"]
[{"$f":"'00'!A16","v":0},null,null,{"$f":"IF(COUNT(E16:L16)=0,\"-\",E16+G16+I16+K16-C16)","v":0},{"$f":"'00'!E16","v":0},null,{"$f":"'00'!G16","v":0},null,{"$f":"'00'!I16","v":0},null,{"$f":"'00'!K16","v":0}]
[0,null,null,0,{"$f":"'00'!E17","v":0},null,{"$f":"'00'!G17","v":0},null,{"$f":"'00'!I17","v":0},null,{"$f":"'00'!K17","v":0}]
[{"$f":"'00'!A18","v":0},null,null,0,{"$f":"'00'!E18","v":0},null,{"$f":"'00'!G18","v":0},null,{"$f":"'00'!I18","v":0},null,{"$f":"'00'!K18","v":0}]
[{"$f":"'00'!A19","v":0},null,null,0,{"$f":"'00'!E19","v":0},null,{"$f":"'00'!G19","v":0},null,{"$f":"'00'!I19","v":0},null,{"$f":"'00'!K19","v":0}]
[{"$f":"'00'!A20","v":0},null,null,0,{"$f":"'00'!E20","v":0},null,{"$f":"'00'!G20","v":0},null,{"$f":"'00'!I20","v":0},null,{"$f":"'00'!K20","v":0}]
[{"$f":"'00'!A21","v":0},null,null,0,{"$f":"'00'!E21","v":0},null,{"$f":"'00'!G21","v":0},null,{"$f":"'00'!I21","v":0},null,{"$f":"'00'!K21","v":0}]
[{"$f":"'00'!A22","v":0},null,null,0,{"$f":"'00'!E22","v":0},null,{"$f":"'00'!G22","v":0},null,{"$f":"'00'!I22","v":0},null,{"$f":"'00'!K22","v":0}]
[{"$f":"'00'!A23","v":0},null,null,0,{"$f":"'00'!E23","v":0},null,{"$f":"'00'!G23","v":0},null,{"$f":"'00'!I23","v":0},null,{"$f":"'00'!K23","v":0}]
[{"$f":"'00'!A24","v":0},null,null,0,{"$f":"'00'!E24","v":0},null,{"$f":"'00'!G24","v":0},null,{"$f":"'00'!I24","v":0},null,{"$f":"'00'!K24","v":0}]
[{"$f":"'00'!A25","v":0},null,null,0,{"$f":"'00'!E25","v":0},null,{"$f":"'00'!G25","v":0},null,{"$f":"'00'!I25","v":0},null,{"$f":"'00'!K25","v":0}]
[{"$f":"'00'!A26","v":0},null,null,0,{"$f":"'00'!E26","v":0},null,{"$f":"'00'!G26","v":0},null,{"$f":"'00'!I26","v":0},null,{"$f":"'00'!K26","v":0}]
[{"$f":"'00'!A27","v":0},null,null,0,{"$f":"'00'!E27","v":0},null,{"$f":"'00'!G27","v":0},null,{"$f":"'00'!I27","v":0},null,{"$f":"'00'!K27","v":0}]
[{"$f":"'00'!A28","v":0},null,null,0,{"$f":"'00'!E28","v":0},null,{"$f":"'00'!G28","v":0},null,{"$f":"'00'!I28","v":0},null,{"$f":"'00'!K28","v":0}]
[{"$f":"'00'!A29","v":0},null,null,0,{"$f":"'00'!E29","v":0},null,{"$f":"'00'!G29","v":0},null,{"$f":"'00'!I29","v":0},null,{"$f":"'00'!K29","v":0}]
[{"$f":"'00'!A30","v":0},null,null,0,{"$f":"'00'!E30","v":0},null,{"$f":"'00'!G30","v":0},null,{"$f":"'00'!I30","v":0},null,{"$f":"'00'!K30","v":0}]
[{"$f":"'00'!A31","v":0},null,null,0,{"$f":"'00'!E31","v":0},null,{"$f":"'00'!G31","v":0},null,{"$f":"'00'!I31","v":0},null,{"$f":"'00'!K31","v":0}]
[{"$f":"'00'!A32","v":"Aptitude naturelle"},null,null,0,{"$f":"'00'!E32","v":0},null,{"$f":"'00'!G32","v":0},null,{"$f":"'00'!I32","v":0},null,{"$f":"'00'!K32","v":0}]
[{"$f":"'00'!A33","v":"Gentillesse"},null,null,0,{"$f":"'00'!E33","v":0},null,{"$f":"'00'!G33","v":0},null,{"$f":"'00'!I33","v":0},null,{"$f":"'00'!K33","v":0}]
[{"$f":"'00'!A34","v":"Intelligence de l'execution"},null,null,0,{"$f":"'00'!E34","v":0},null,{"$f":"'00'!G34","v":0},null,{"$f":"'00'!I34","v":0},null,{"$f":"'00'!K34","v":0}]
[{"$f":"'00'!A35","v":"Obéissance"},null,null,0,{"$f":"'00'!E35","v":0},null,{"$f":"'00'!G35","v":0},null,{"$f":"'00'!I35","v":0},null,{"$f":"'00'!K35","v":0}]
["POINTS TOTAL",null,{"$f":"SUM(C16:C35)","v":0},{"$f":"SUM(D16:D35)","v":0},{"$f":"'00'!E36","v":50},null,{"$f":"'00'!G36","v":30},null,{"$f":"'00'!I36","v":0},null,{"$f":"'00'!K36","v":20}]
["Détails des pénéalités ",null,null,"0","Pénalités en Négatif",null,null,null,"RANKING"]
[" POINTS",{"$f":"IF((C36)=0,\"-\",D36+D37)","v":"-"},{"$f":"IF(COUNT(D38:K38)=0,\"-\",D38+F38+H38+J38-B38)","v":"-"},"EVALUATION",null,{"$f":"$L$55","v":"-"},null,null,{"$f":"'Rapport de concours '!N26","v":"X"},null,null,{"$f":"COUNT(S17:S34)","v":0}]
["CACIT / RCACIT  / CACT  / RCACT  :",".",null," <== UPON JUDGE'S DECISION"]
["Observations :  ",null,null,null,null,null,null,null,null,null,null,null,null,null,null,null,0]
[]
[]
[]
[]
[null,null,null,null,null,null,null,null,null,null,null,null,null,null,null,null,48,"IHT1","GUARDING",null,35]
[null,null,null,null,null,null,null,null,null,null,null,null,null,null,null,null,49,"IHT1","MOVING",null,45]
[null,null,null,null,null,null,null,null,null,null,null,null,null,null,null,null,50,"IHT1","DIFFICULT PASS",null,10]
[null,null,null,null,null,null,null,null,null,null,null,null,null,null,null,null,51,"IHT1","BEHAVIOUR",null,10]
[null,null,null,null,null,null,null,null,null,null,null,null,null,null,null,null,52,"IHT2","GUARDING",null,35]
[null,null,null,null,null,null,null,null,null,null,null,null,null,null,null,null,53,"IHT2","MOVING",null,55]
[null,null,null,null,null,null,null,null,null,null,null,null,null,null,null,null,54,"IHT2","DIFFICULT PASS",null,20]
[null,null,null,null,null,null,null,null,null,null,null,null,null,null,null,null,55,"IHT2","BEHAVIOUR",null,10]
[null,null,null,null,null,null,null,null,null,null,null,null,null,null,null,null,56,"IHT3","GUARDING",null,40]
[null,null,null,null,null,null,null,null,null,null,null,null,null,null,null,null,57,"IHT3","MOVING",null,70]
[null,null,null,null,null,null,null,null,null,null,null,{"$f":"IF(B38=\"-\",\"-\",IF(B38>S58,\"EXCELLENT\",IF(B38>T58,\"TRES BON\",IF(B38>U58,\"BON\",IF(B38>V58,\"insuffisant\",IF(B37>0.1,\"insuffisant \",\"éliminé \"))))))","v":"-"},null,null,null,null,58,"IHT3","DIFFICULT PASS",null,30]
[null,null,null,null,null,null,null,null,null,null,null,null,null,null,null,null,59,"IHT3","BEHAVIOUR",null,10]
[]
[null,null,null,null,null,null,null,null,null,null,null,null,null,null,null,null,"IHT1",100,{"$f":"R58*89.999/100","v":89.998999999999995},{"$f":"R58*79.999/100","v":79.998999999999995},{"$f":"R58*69.999/100","v":69.998999999999995},{"$f":"R58*59.999/100","v":59.999000000000002},0.1]
[null,null,null,null,null,null,null,null,null,null,null,null,null,null,null,null,"iIHT2",120,{"$f":"R59*89.999/100","v":107.99879999999999},{"$f":"R59*79.999/100","v":95.998799999999989},{"$f":"R59*69.999/100","v":83.998799999999989},{"$f":"R59*59.999/100","v":71.998800000000003},0.1]
[null,null,null,null,null,null,null,null,null,null,null,null,null,null,null,null,"IHT3",150,134.99849999999998,{"$f":"R60*79.999/100","v":119.99849999999998},{"$f":"R60*69.999/100","v":104.99849999999998},{"$f":"R60*59.999/100","v":89.998500000000007},0.1]

{"sheet":"11","index":16,"n_rows":60,"n_cols":23,"rows_kept":60,"cut":false,"hidden":false,"merged":[[2,1,2,10],[4,6,4,8],[6,2,6,3],[6,4,6,10],[7,4,7,10],[8,2,8,3],[8,4,8,10],[13,0,13,1],[13,2,13,3],[13,4,13,5],[13,6,13,7],[13,8,13,9],[13,10,13,11],[9,2,9,3],[9,4,9,10],[10,2,10,3],[10,4,10,10],[11,2,11,3],[11,4,11,10],[14,4,14,5],[14,6,14,7],[14,8,14,9],[14,10,14,11],[15,4,15,5],[15,6,15,7],[15,8,15,9],[15,10,15,11],[12,4,12,10],[18,4,18,5],[18,6,18,7],[18,8,18,9],[18,10,18,11],[19,4,19,5],[19,6,19,7],[19,8,19,9],[19,10,19,11],[16,4,16,5],[16,6,16,7],[16,8,16,9],[16,10,16,11],[17,4,17,5],[17,6,17,7],[17,8,17,9],[17,10,17,11],[22,4,22,5],[22,6,22,7],[22,8,22,9],[22,10,22,11],[23,4,23,5],[23,6,23,7],[23,8,23,9],[23,10,23,11],[20,4,20,5],[20,6,20,7],[20,8,20,9],[20,10,20,11],[21,4,21,5],[21,6,21,7],[21,8,21,9],[21,10,21,11],[26,4,26,5],[26,6,26,7],[26,8,26,9],[26,10,26,11],[27,4,27,5],[27,6,27,7],[27,8,27,9],[27,10,27,11],[24,4,24,5],[24,6,24,7],[24,8,24,9],[24,10,24,11],[25,4,25,5],[25,6,25,7],[25,8,25,9],[25,10,25,11],[30,4,30,5],[30,6,30,7],[30,8,30,9],[30,10,30,11],[31,4,31,5],[31,6,31,7],[31,8,31,9],[31,10,31,11],[28,4,28,5],[28,6,28,7],[28,8,28,9],[28,10,28,11],[29,4,29,5],[29,6,29,7],[29,8,29,9],[29,10,29,11],[34,4,34,5],[34,6,34,7],[34,8,34,9],[34,10,34,11],[35,4,35,5],[35,6,35,7],[35,8,35,9],[35,10,35,11],[32,4,32,5],[32,6,32,7],[32,8,32,9],[32,10,32,11],[33,4,33,5],[33,6,33,7],[33,8,33,9],[33,10,33,11],[38,1,38,2],[38,3,38,11],[39,1,39,11],[44,18,44,19],[45,18,45,19],[46,18,46,19],[36,1,36,2],[36,4,36,7],[36,8,36,11],[37,1,37,2],[37,3,37,4],[37,5,37,7],[37,8,37,10],[53,18,53,19],[54,18,54,19],[55,18,55,19],[47,18,47,19],[48,18,48,19],[49,18,49,19],[50,18,50,19],[51,18,51,19],[52,18,52,19]]}
[null,null,null,null,null,null,"IHT TS","HWT"]
[]
[]
[]
[null,"IHT TS ",null,null,null,null,"COUNTRY LOGO"]
["Organisation",{"$f":"'Fiche organisateur N2'!F5","v":0}]
["Ville",{"$f":"'Fiche organisateur N2'!F6","v":0},"Date : ",null,{"$f":"'Fiche organisateur N2'!$H$8","v":0}]
["Contact : ",0]
["Propriètaire",{"$f":"'Fiche organisateur N2'!$C$27","v":0},"Race et sexe",null,{"$f":"'Fiche organisateur N2'!$G$27","v":0}]
["Conducteur",{"$f":"'Fiche organisateur N2'!$D$27","v":0},"Né",null,{"$f":"'Fiche organisateur N2'!$K$27","v":0}]
["Nom du chien",{"$f":"'Fiche organisateur N2'!$E$27","v":0},"PEDIGREE",null,{"$f":"'Fiche organisateur N2'!$J$27","v":0}]
["Affixe",{"$f":"'Fiche organisateur N2'!$F$27","v":0},"Identifiant ",null,{"$f":"'Fiche organisateur N2'!$L$17","v":0}]
[]
["for the country--->"]
["EXERCISES ","OBSERVATIONS","Mini","SCORE","GUARDING",null,"MOVING",null,"DIFFICULT PASSAGES",null,"BEHAVIOUR"]
[{"$f":"'00'!A16","v":0},null,null,{"$f":"IF(COUNT(E16:L16)=0,\"-\",E16+G16+I16+K16-C16)","v":0},{"$f":"'00'!E16","v":0},null,{"$f":"'00'!G16","v":0},null,{"$f":"'00'!I16","v":0},null,{"$f":"'00'!K16","v":0}]
[0,null,null,0,{"$f":"'00'!E17","v":0},null,{"$f":"'00'!G17","v":0},null,{"$f":"'00'!I17","v":0},null,{"$f":"'00'!K17","v":0}]
[{"$f":"'00'!A18","v":0},null,null,0,{"$f":"'00'!E18","v":0},null,{"$f":"'00'!G18","v":0},null,{"$f":"'00'!I18","v":0},null,{"$f":"'00'!K18","v":0}]
[{"$f":"'00'!A19","v":0},null,null,0,{"$f":"'00'!E19","v":0},null,{"$f":"'00'!G19","v":0},null,{"$f":"'00'!I19","v":0},null,{"$f":"'00'!K19","v":0}]
[{"$f":"'00'!A20","v":0},null,null,0,{"$f":"'00'!E20","v":0},null,{"$f":"'00'!G20","v":0},null,{"$f":"'00'!I20","v":0},null,{"$f":"'00'!K20","v":0}]
[{"$f":"'00'!A21","v":0},null,null,0,{"$f":"'00'!E21","v":0},null,{"$f":"'00'!G21","v":0},null,{"$f":"'00'!I21","v":0},null,{"$f":"'00'!K21","v":0}]
[{"$f":"'00'!A22","v":0},null,null,0,{"$f":"'00'!E22","v":0},null,{"$f":"'00'!G22","v":0},null,{"$f":"'00'!I22","v":0},null,{"$f":"'00'!K22","v":0}]
[{"$f":"'00'!A23","v":0},null,null,0,{"$f":"'00'!E23","v":0},null,{"$f":"'00'!G23","v":0},null,{"$f":"'00'!I23","v":0},null,{"$f":"'00'!K23","v":0}]
[{"$f":"'00'!A24","v":0},null,null,0,{"$f":"'00'!E24","v":0},null,{"$f":"'00'!G24","v":0},null,{"$f":"'00'!I24","v":0},null,{"$f":"'00'!K24","v":0}]
[{"$f":"'00'!A25","v":0},null,null,0,{"$f":"'00'!E25","v":0},null,{"$f":"'00'!G25","v":0},null,{"$f":"'00'!I25","v":0},null,{"$f":"'00'!K25","v":0}]
[{"$f":"'00'!A26","v":0},null,null,0,{"$f":"'00'!E26","v":0},null,{"$f":"'00'!G26","v":0},null,{"$f":"'00'!I26","v":0},null,{"$f":"'00'!K26","v":0}]
[{"$f":"'00'!A27","v":0},null,null,0,{"$f":"'00'!E27","v":0},null,{"$f":"'00'!G27","v":0},null,{"$f":"'00'!I27","v":0},null,{"$f":"'00'!K27","v":0}]
[{"$f":"'00'!A28","v":0},null,null,0,{"$f":"'00'!E28","v":0},null,{"$f":"'00'!G28","v":0},null,{"$f":"'00'!I28","v":0},null,{"$f":"'00'!K28","v":0}]
[{"$f":"'00'!A29","v":0},null,null,0,{"$f":"'00'!E29","v":0},null,{"$f":"'00'!G29","v":0},null,{"$f":"'00'!I29","v":0},null,{"$f":"'00'!K29","v":0}]
[{"$f":"'00'!A30","v":0},null,null,0,{"$f":"'00'!E30","v":0},null,{"$f":"'00'!G30","v":0},null,{"$f":"'00'!I30","v":0},null,{"$f":"'00'!K30","v":0}]
[{"$f":"'00'!A31","v":0},null,null,0,{"$f":"'00'!E31","v":0},null,{"$f":"'00'!G31","v":0},null,{"$f":"'00'!I31","v":0},null,{"$f":"'00'!K31","v":0}]
[{"$f":"'00'!A32","v":"Aptitude naturelle"},null,null,0,{"$f":"'00'!E32","v":0},null,{"$f":"'00'!G32","v":0},null,{"$f":"'00'!I32","v":0},null,{"$f":"'00'!K32","v":0}]
[{"$f":"'00'!A33","v":"Gentillesse"},null,null,0,{"$f":"'00'!E33","v":0},null,{"$f":"'00'!G33","v":0},null,{"$f":"'00'!I33","v":0},null,{"$f":"'00'!K33","v":0}]
[{"$f":"'00'!A34","v":"Intelligence de l'execution"},null,null,0,{"$f":"'00'!E34","v":0},null,{"$f":"'00'!G34","v":0},null,{"$f":"'00'!I34","v":0},null,{"$f":"'00'!K34","v":0}]
[{"$f":"'00'!A35","v":"Obéissance"},null,null,0,{"$f":"'00'!E35","v":0},null,{"$f":"'00'!G35","v":0},null,{"$f":"'00'!I35","v":0},null,{"$f":"'00'!K35","v":0}]
["POINTS TOTAL",null,{"$f":"SUM(C16:C35)","v":0},{"$f":"SUM(D16:D35)","v":0},{"$f":"'00'!E36","v":50},null,{"$f":"'00'!G36","v":30},null,{"$f":"'00'!I36","v":0},null,{"$f":"'00'!K36","v":20}]
["Détails des pénéalités ",null,null,"0","Pénalités en Négatif",null,null,null,"RANKING"]
[" POINTS",{"$f":"IF((C36)=0,\"-\",D36+D37)","v":"-"},{"$f":"IF(COUNT(D38:K38)=0,\"-\",D38+F38+H38+J38-B38)","v":"-"},"EVALUATION",null,{"$f":"$L$55","v":"-"},null,null,{"$f":"'Rapport de concours '!N27","v":"X"},null,null,{"$f":"COUNT(S17:S34)","v":0}]
["CACIT / RCACIT  / CACT  / RCACT  :",".",null," <== UPON JUDGE'S DECISION"]
["Observations :  ",null,null,null,null,null,null,null,null,null,null,null,null,null,null,null,0]
[]
[]
[]
[]
[null,null,null,null,null,null,null,null,null,null,null,null,null,null,null,null,48,"IHT1","GUARDING",null,35]
[null,null,null,null,null,null,null,null,null,null,null,null,null,null,null,null,49,"IHT1","MOVING",null,45]
[null,null,null,null,null,null,null,null,null,null,null,null,null,null,null,null,50,"IHT1","DIFFICULT PASS",null,10]
[null,null,null,null,null,null,null,null,null,null,null,null,null,null,null,null,51,"IHT1","BEHAVIOUR",null,10]
[null,null,null,null,null,null,null,null,null,null,null,null,null,null,null,null,52,"IHT2","GUARDING",null,35]
[null,null,null,null,null,null,null,null,null,null,null,null,null,null,null,null,53,"IHT2","MOVING",null,55]
[null,null,null,null,null,null,null,null,null,null,null,null,null,null,null,null,54,"IHT2","DIFFICULT PASS",null,20]
[null,null,null,null,null,null,null,null,null,null,null,null,null,null,null,null,55,"IHT2","BEHAVIOUR",null,10]
[null,null,null,null,null,null,null,null,null,null,null,null,null,null,null,null,56,"IHT3","GUARDING",null,40]
[null,null,null,null,null,null,null,null,null,null,null,null,null,null,null,null,57,"IHT3","MOVING",null,70]
[null,null,null,null,null,null,null,null,null,null,null,{"$f":"IF(B38=\"-\",\"-\",IF(B38>S58,\"EXCELLENT\",IF(B38>T58,\"TRES BON\",IF(B38>U58,\"BON\",IF(B38>V58,\"insuffisant\",IF(B37>0.1,\"insuffisant \",\"éliminé \"))))))","v":"-"},null,null,null,null,58,"IHT3","DIFFICULT PASS",null,30]
[null,null,null,null,null,null,null,null,null,null,null,null,null,null,null,null,59,"IHT3","BEHAVIOUR",null,10]
[]
[null,null,null,null,null,null,null,null,null,null,null,null,null,null,null,null,"IHT1",100,{"$f":"R58*89.999/100","v":89.998999999999995},{"$f":"R58*79.999/100","v":79.998999999999995},{"$f":"R58*69.999/100","v":69.998999999999995},{"$f":"R58*59.999/100","v":59.999000000000002},0.1]
[null,null,null,null,null,null,null,null,null,null,null,null,null,null,null,null,"iIHT2",120,{"$f":"R59*89.999/100","v":107.99879999999999},{"$f":"R59*79.999/100","v":95.998799999999989},{"$f":"R59*69.999/100","v":83.998799999999989},{"$f":"R59*59.999/100","v":71.998800000000003},0.1]
[null,null,null,null,null,null,null,null,null,null,null,null,null,null,null,null,"IHT3",150,134.99849999999998,{"$f":"R60*79.999/100","v":119.99849999999998},{"$f":"R60*69.999/100","v":104.99849999999998},{"$f":"R60*59.999/100","v":89.998500000000007},0.1]

{"sheet":"12","index":17,"n_rows":60,"n_cols":23,"rows_kept":60,"cut":false,"hidden":false,"merged":[[2,1,2,10],[4,6,4,8],[6,2,6,3],[6,4,6,10],[7,4,7,10],[8,2,8,3],[8,4,8,10],[13,0,13,1],[13,2,13,3],[13,4,13,5],[13,6,13,7],[13,8,13,9],[13,10,13,11],[9,2,9,3],[9,4,9,10],[10,2,10,3],[10,4,10,10],[11,2,11,3],[11,4,11,10],[14,4,14,5],[14,6,14,7],[14,8,14,9],[14,10,14,11],[15,4,15,5],[15,6,15,7],[15,8,15,9],[15,10,15,11],[12,4,12,10],[18,4,18,5],[18,6,18,7],[18,8,18,9],[18,10,18,11],[19,4,19,5],[19,6,19,7],[19,8,19,9],[19,10,19,11],[16,4,16,5],[16,6,16,7],[16,8,16,9],[16,10,16,11],[17,4,17,5],[17,6,17,7],[17,8,17,9],[17,10,17,11],[22,4,22,5],[22,6,22,7],[22,8,22,9],[22,10,22,11],[23,4,23,5],[23,6,23,7],[23,8,23,9],[23,10,23,11],[20,4,20,5],[20,6,20,7],[20,8,20,9],[20,10,20,11],[21,4,21,5],[21,6,21,7],[21,8,21,9],[21,10,21,11],[26,4,26,5],[26,6,26,7],[26,8,26,9],[26,10,26,11],[27,4,27,5],[27,6,27,7],[27,8,27,9],[27,10,27,11],[24,4,24,5],[24,6,24,7],[24,8,24,9],[24,10,24,11],[25,4,25,5],[25,6,25,7],[25,8,25,9],[25,10,25,11],[30,4,30,5],[30,6,30,7],[30,8,30,9],[30,10,30,11],[31,4,31,5],[31,6,31,7],[31,8,31,9],[31,10,31,11],[28,4,28,5],[28,6,28,7],[28,8,28,9],[28,10,28,11],[29,4,29,5],[29,6,29,7],[29,8,29,9],[29,10,29,11],[34,4,34,5],[34,6,34,7],[34,8,34,9],[34,10,34,11],[35,4,35,5],[35,6,35,7],[35,8,35,9],[35,10,35,11],[32,4,32,5],[32,6,32,7],[32,8,32,9],[32,10,32,11],[33,4,33,5],[33,6,33,7],[33,8,33,9],[33,10,33,11],[38,1,38,2],[38,3,38,11],[39,1,39,11],[44,18,44,19],[45,18,45,19],[46,18,46,19],[36,1,36,2],[36,4,36,7],[36,8,36,11],[37,1,37,2],[37,3,37,4],[37,5,37,7],[37,8,37,10],[53,18,53,19],[54,18,54,19],[55,18,55,19],[47,18,47,19],[48,18,48,19],[49,18,49,19],[50,18,50,19],[51,18,51,19],[52,18,52,19]]}
[null,null,null,null,null,null,"IHT TS",{"$f":"'Fiche organisateur N1'!#REF!","v":{"$error":"#REF!"}}]
[]
[]
[]
[null,"IHT TS ",null,null,null,null,"COUNTRY LOGO"]
["Organisation",{"$f":"'Fiche organisateur N2'!F5","v":0}]
["Ville",{"$f":"'Fiche organisateur N2'!F6","v":0},"Date : ",null,{"$f":"'Fiche organisateur N2'!$H$8","v":0}]
["Contact : ",0]
["Propriètaire",{"$f":"'Fiche organisateur N2'!$C$28","v":0},"Race et sexe",null,{"$f":"'Fiche organisateur N2'!$G$28","v":0}]
["Conducteur",{"$f":"'Fiche organisateur N2'!$D$28","v":0},"Né",null,{"$f":"'Fiche organisateur N2'!$K$28","v":0}]
["Nom du chien",{"$f":"'Fiche organisateur N2'!$E$28","v":0},"PEDIGREE",null,{"$f":"'Fiche organisateur N2'!$J$28","v":0}]
["Affixe",{"$f":"'Fiche organisateur N2'!$F$28","v":0},"Identifiant ",null,{"$f":"'Fiche organisateur N2'!$L$28","v":0}]
[]
["for the country--->"]
["EXERCISES ","OBSERVATIONS","Mini","SCORE","GUARDING",null,"MOVING",null,"DIFFICULT PASSAGES",null,"BEHAVIOUR"]
[{"$f":"'00'!A16","v":0},null,null,{"$f":"IF(COUNT(E16:L16)=0,\"-\",E16+G16+I16+K16-C16)","v":0},{"$f":"'00'!E16","v":0},null,{"$f":"'00'!G16","v":0},null,{"$f":"'00'!I16","v":0},null,{"$f":"'00'!K16","v":0}]
[0,null,null,0,{"$f":"'00'!E17","v":0},null,{"$f":"'00'!G17","v":0},null,{"$f":"'00'!I17","v":0},null,{"$f":"'00'!K17","v":0}]
[{"$f":"'00'!A18","v":0},null,null,0,{"$f":"'00'!E18","v":0},null,{"$f":"'00'!G18","v":0},null,{"$f":"'00'!I18","v":0},null,{"$f":"'00'!K18","v":0}]
[{"$f":"'00'!A19","v":0},null,null,0,{"$f":"'00'!E19","v":0},null,{"$f":"'00'!G19","v":0},null,{"$f":"'00'!I19","v":0},null,{"$f":"'00'!K19","v":0}]
[{"$f":"'00'!A20","v":0},null,null,0,{"$f":"'00'!E20","v":0},null,{"$f":"'00'!G20","v":0},null,{"$f":"'00'!I20","v":0},null,{"$f":"'00'!K20","v":0}]
[{"$f":"'00'!A21","v":0},null,null,0,{"$f":"'00'!E21","v":0},null,{"$f":"'00'!G21","v":0},null,{"$f":"'00'!I21","v":0},null,{"$f":"'00'!K21","v":0}]
[{"$f":"'00'!A22","v":0},null,null,0,{"$f":"'00'!E22","v":0},null,{"$f":"'00'!G22","v":0},null,{"$f":"'00'!I22","v":0},null,{"$f":"'00'!K22","v":0}]
[{"$f":"'00'!A23","v":0},null,null,0,{"$f":"'00'!E23","v":0},null,{"$f":"'00'!G23","v":0},null,{"$f":"'00'!I23","v":0},null,{"$f":"'00'!K23","v":0}]
[{"$f":"'00'!A24","v":0},null,null,0,{"$f":"'00'!E24","v":0},null,{"$f":"'00'!G24","v":0},null,{"$f":"'00'!I24","v":0},null,{"$f":"'00'!K24","v":0}]
[{"$f":"'00'!A25","v":0},null,null,0,{"$f":"'00'!E25","v":0},null,{"$f":"'00'!G25","v":0},null,{"$f":"'00'!I25","v":0},null,{"$f":"'00'!K25","v":0}]
[{"$f":"'00'!A26","v":0},null,null,0,{"$f":"'00'!E26","v":0},null,{"$f":"'00'!G26","v":0},null,{"$f":"'00'!I26","v":0},null,{"$f":"'00'!K26","v":0}]
[{"$f":"'00'!A27","v":0},null,null,0,{"$f":"'00'!E27","v":0},null,{"$f":"'00'!G27","v":0},null,{"$f":"'00'!I27","v":0},null,{"$f":"'00'!K27","v":0}]
[{"$f":"'00'!A28","v":0},null,null,0,{"$f":"'00'!E28","v":0},null,{"$f":"'00'!G28","v":0},null,{"$f":"'00'!I28","v":0},null,{"$f":"'00'!K28","v":0}]
[{"$f":"'00'!A29","v":0},null,null,0,{"$f":"'00'!E29","v":0},null,{"$f":"'00'!G29","v":0},null,{"$f":"'00'!I29","v":0},null,{"$f":"'00'!K29","v":0}]
[{"$f":"'00'!A30","v":0},null,null,0,{"$f":"'00'!E30","v":0},null,{"$f":"'00'!G30","v":0},null,{"$f":"'00'!I30","v":0},null,{"$f":"'00'!K30","v":0}]
[{"$f":"'00'!A31","v":0},null,null,0,{"$f":"'00'!E31","v":0},null,{"$f":"'00'!G31","v":0},null,{"$f":"'00'!I31","v":0},null,{"$f":"'00'!K31","v":0}]
[{"$f":"'00'!A32","v":"Aptitude naturelle"},null,null,0,{"$f":"'00'!E32","v":0},null,{"$f":"'00'!G32","v":0},null,{"$f":"'00'!I32","v":0},null,{"$f":"'00'!K32","v":0}]
[{"$f":"'00'!A33","v":"Gentillesse"},null,null,0,{"$f":"'00'!E33","v":0},null,{"$f":"'00'!G33","v":0},null,{"$f":"'00'!I33","v":0},null,{"$f":"'00'!K33","v":0}]
[{"$f":"'00'!A34","v":"Intelligence de l'execution"},null,null,0,{"$f":"'00'!E34","v":0},null,{"$f":"'00'!G34","v":0},null,{"$f":"'00'!I34","v":0},null,{"$f":"'00'!K34","v":0}]
[{"$f":"'00'!A35","v":"Obéissance"},null,null,0,{"$f":"'00'!E35","v":0},null,{"$f":"'00'!G35","v":0},null,{"$f":"'00'!I35","v":0},null,{"$f":"'00'!K35","v":0}]
["POINTS TOTAL",null,{"$f":"SUM(C16:C35)","v":0},{"$f":"SUM(D16:D35)","v":0},{"$f":"'00'!E36","v":50},null,{"$f":"'00'!G36","v":30},null,{"$f":"'00'!I36","v":0},null,{"$f":"'00'!K36","v":20}]
["Détails des pénéalités ",null,null,"0","Pénalités en Négatif",null,null,null,"RANKING"]
[" POINTS",{"$f":"IF((C36)=0,\"-\",D36+D37)","v":"-"},{"$f":"IF(COUNT(D38:K38)=0,\"-\",D38+F38+H38+J38-B38)","v":"-"},"EVALUATION",null,{"$f":"$L$55","v":"-"},null,null,{"$f":"'Rapport de concours '!N28","v":"X"},null,null,{"$f":"COUNT(S17:S34)","v":0}]
["CACIT / RCACIT  / CACT  / RCACT  :",".",null," <== UPON JUDGE'S DECISION"]
["Observations :  ",null,null,null,null,null,null,null,null,null,null,null,null,null,null,null,0]
[]
[]
[]
[]
[null,null,null,null,null,null,null,null,null,null,null,null,null,null,null,null,48,"IHT1","GUARDING",null,35]
[null,null,null,null,null,null,null,null,null,null,null,null,null,null,null,null,49,"IHT1","MOVING",null,45]
[null,null,null,null,null,null,null,null,null,null,null,null,null,null,null,null,50,"IHT1","DIFFICULT PASS",null,10]
[null,null,null,null,null,null,null,null,null,null,null,null,null,null,null,null,51,"IHT1","BEHAVIOUR",null,10]
[null,null,null,null,null,null,null,null,null,null,null,null,null,null,null,null,52,"IHT2","GUARDING",null,35]
[null,null,null,null,null,null,null,null,null,null,null,null,null,null,null,null,53,"IHT2","MOVING",null,55]
[null,null,null,null,null,null,null,null,null,null,null,null,null,null,null,null,54,"IHT2","DIFFICULT PASS",null,20]
[null,null,null,null,null,null,null,null,null,null,null,null,null,null,null,null,55,"IHT2","BEHAVIOUR",null,10]
[null,null,null,null,null,null,null,null,null,null,null,null,null,null,null,null,56,"IHT3","GUARDING",null,40]
[null,null,null,null,null,null,null,null,null,null,null,null,null,null,null,null,57,"IHT3","MOVING",null,70]
[null,null,null,null,null,null,null,null,null,null,null,{"$f":"IF(B38=\"-\",\"-\",IF(B38>S58,\"EXCELLENT\",IF(B38>T58,\"TRES BON\",IF(B38>U58,\"BON\",IF(B38>V58,\"insuffisant\",IF(B37>0.1,\"insuffisant \",\"éliminé \"))))))","v":"-"},null,null,null,null,58,"IHT3","DIFFICULT PASS",null,30]
[null,null,null,null,null,null,null,null,null,null,null,null,null,null,null,null,59,"IHT3","BEHAVIOUR",null,10]
[]
[null,null,null,null,null,null,null,null,null,null,null,null,null,null,null,null,"IHT1",100,{"$f":"R58*89.999/100","v":89.998999999999995},{"$f":"R58*79.999/100","v":79.998999999999995},{"$f":"R58*69.999/100","v":69.998999999999995},{"$f":"R58*59.999/100","v":59.999000000000002},0.1]
[null,null,null,null,null,null,null,null,null,null,null,null,null,null,null,null,"iIHT2",120,{"$f":"R59*89.999/100","v":107.99879999999999},{"$f":"R59*79.999/100","v":95.998799999999989},{"$f":"R59*69.999/100","v":83.998799999999989},{"$f":"R59*59.999/100","v":71.998800000000003},0.1]
[null,null,null,null,null,null,null,null,null,null,null,null,null,null,null,null,"IHT3",150,134.99849999999998,{"$f":"R60*79.999/100","v":119.99849999999998},{"$f":"R60*69.999/100","v":104.99849999999998},{"$f":"R60*59.999/100","v":89.998500000000007},0.1]

{"sheet":"13","index":18,"n_rows":60,"n_cols":23,"rows_kept":60,"cut":false,"hidden":false,"merged":[[2,1,2,10],[4,6,4,8],[6,2,6,3],[6,4,6,10],[7,4,7,10],[8,2,8,3],[8,4,8,10],[13,0,13,1],[13,2,13,3],[13,4,13,5],[13,6,13,7],[13,8,13,9],[13,10,13,11],[9,2,9,3],[9,4,9,10],[10,2,10,3],[10,4,10,10],[11,2,11,3],[11,4,11,10],[14,4,14,5],[14,6,14,7],[14,8,14,9],[14,10,14,11],[15,4,15,5],[15,6,15,7],[15,8,15,9],[15,10,15,11],[12,4,12,10],[18,4,18,5],[18,6,18,7],[18,8,18,9],[18,10,18,11],[19,4,19,5],[19,6,19,7],[19,8,19,9],[19,10,19,11],[16,4,16,5],[16,6,16,7],[16,8,16,9],[16,10,16,11],[17,4,17,5],[17,6,17,7],[17,8,17,9],[17,10,17,11],[22,4,22,5],[22,6,22,7],[22,8,22,9],[22,10,22,11],[23,4,23,5],[23,6,23,7],[23,8,23,9],[23,10,23,11],[20,4,20,5],[20,6,20,7],[20,8,20,9],[20,10,20,11],[21,4,21,5],[21,6,21,7],[21,8,21,9],[21,10,21,11],[26,4,26,5],[26,6,26,7],[26,8,26,9],[26,10,26,11],[27,4,27,5],[27,6,27,7],[27,8,27,9],[27,10,27,11],[24,4,24,5],[24,6,24,7],[24,8,24,9],[24,10,24,11],[25,4,25,5],[25,6,25,7],[25,8,25,9],[25,10,25,11],[30,4,30,5],[30,6,30,7],[30,8,30,9],[30,10,30,11],[31,4,31,5],[31,6,31,7],[31,8,31,9],[31,10,31,11],[28,4,28,5],[28,6,28,7],[28,8,28,9],[28,10,28,11],[29,4,29,5],[29,6,29,7],[29,8,29,9],[29,10,29,11],[34,4,34,5],[34,6,34,7],[34,8,34,9],[34,10,34,11],[35,4,35,5],[35,6,35,7],[35,8,35,9],[35,10,35,11],[32,4,32,5],[32,6,32,7],[32,8,32,9],[32,10,32,11],[33,4,33,5],[33,6,33,7],[33,8,33,9],[33,10,33,11],[38,1,38,2],[38,3,38,11],[39,1,39,11],[44,18,44,19],[45,18,45,19],[46,18,46,19],[36,1,36,2],[36,4,36,7],[36,8,36,11],[37,1,37,2],[37,3,37,4],[37,5,37,7],[37,8,37,10],[53,18,53,19],[54,18,54,19],[55,18,55,19],[47,18,47,19],[48,18,48,19],[49,18,49,19],[50,18,50,19],[51,18,51,19],[52,18,52,19]]}
[null,null,null,null,null,null,"IHT TS","HWT"]
[]
[]
[]
[null,"IHT TS ",null,null,null,null,"COUNTRY LOGO"]
["Organisation",{"$f":"'Fiche organisateur N2'!F5","v":0}]
["Ville",{"$f":"'Fiche organisateur N2'!F6","v":0},"Date : ",null,{"$f":"'Fiche organisateur N2'!$H$8","v":0}]
["Contact : ",0]
["Propriètaire",{"$f":"'Fiche organisateur N2'!$C$29","v":0},"Race et sexe",null,{"$f":"'Fiche organisateur N2'!$G$29","v":0}]
["Conducteur",{"$f":"'Fiche organisateur N2'!$D$29","v":0},"Né",null,{"$f":"'Fiche organisateur N2'!$K$29","v":0}]
["Nom du chien",{"$f":"'Fiche organisateur N2'!$E$29","v":0},"PEDIGREE",null,{"$f":"'Fiche organisateur N2'!$J$29","v":0}]
["Affixe",{"$f":"'Fiche organisateur N2'!$F$29","v":0},"Identifiant ",null,{"$f":"'Fiche organisateur N2'!$L$29","v":0}]
[]
["for the country--->"]
["EXERCISES ","OBSERVATIONS","Mini","SCORE","GUARDING",null,"MOVING",null,"DIFFICULT PASSAGES",null,"BEHAVIOUR"]
[{"$f":"'00'!A16","v":0},null,null,{"$f":"IF(COUNT(E16:L16)=0,\"-\",E16+G16+I16+K16-C16)","v":0},{"$f":"'00'!E16","v":0},null,{"$f":"'00'!G16","v":0},null,{"$f":"'00'!I16","v":0},null,{"$f":"'00'!K16","v":0}]
[0,null,null,0,{"$f":"'00'!E17","v":0},null,{"$f":"'00'!G17","v":0},null,{"$f":"'00'!I17","v":0},null,{"$f":"'00'!K17","v":0}]
[{"$f":"'00'!A18","v":0},null,null,0,{"$f":"'00'!E18","v":0},null,{"$f":"'00'!G18","v":0},null,{"$f":"'00'!I18","v":0},null,{"$f":"'00'!K18","v":0}]
[{"$f":"'00'!A19","v":0},null,null,0,{"$f":"'00'!E19","v":0},null,{"$f":"'00'!G19","v":0},null,{"$f":"'00'!I19","v":0},null,{"$f":"'00'!K19","v":0}]
[{"$f":"'00'!A20","v":0},null,null,0,{"$f":"'00'!E20","v":0},null,{"$f":"'00'!G20","v":0},null,{"$f":"'00'!I20","v":0},null,{"$f":"'00'!K20","v":0}]
[{"$f":"'00'!A21","v":0},null,null,0,{"$f":"'00'!E21","v":0},null,{"$f":"'00'!G21","v":0},null,{"$f":"'00'!I21","v":0},null,{"$f":"'00'!K21","v":0}]
[{"$f":"'00'!A22","v":0},null,null,0,{"$f":"'00'!E22","v":0},null,{"$f":"'00'!G22","v":0},null,{"$f":"'00'!I22","v":0},null,{"$f":"'00'!K22","v":0}]
[{"$f":"'00'!A23","v":0},null,null,0,{"$f":"'00'!E23","v":0},null,{"$f":"'00'!G23","v":0},null,{"$f":"'00'!I23","v":0},null,{"$f":"'00'!K23","v":0}]
[{"$f":"'00'!A24","v":0},null,null,0,{"$f":"'00'!E24","v":0},null,{"$f":"'00'!G24","v":0},null,{"$f":"'00'!I24","v":0},null,{"$f":"'00'!K24","v":0}]
[{"$f":"'00'!A25","v":0},null,null,0,{"$f":"'00'!E25","v":0},null,{"$f":"'00'!G25","v":0},null,{"$f":"'00'!I25","v":0},null,{"$f":"'00'!K25","v":0}]
[{"$f":"'00'!A26","v":0},null,null,0,{"$f":"'00'!E26","v":0},null,{"$f":"'00'!G26","v":0},null,{"$f":"'00'!I26","v":0},null,{"$f":"'00'!K26","v":0}]
[{"$f":"'00'!A27","v":0},null,null,0,{"$f":"'00'!E27","v":0},null,{"$f":"'00'!G27","v":0},null,{"$f":"'00'!I27","v":0},null,{"$f":"'00'!K27","v":0}]
[{"$f":"'00'!A28","v":0},null,null,0,{"$f":"'00'!E28","v":0},null,{"$f":"'00'!G28","v":0},null,{"$f":"'00'!I28","v":0},null,{"$f":"'00'!K28","v":0}]
[{"$f":"'00'!A29","v":0},null,null,0,{"$f":"'00'!E29","v":0},null,{"$f":"'00'!G29","v":0},null,{"$f":"'00'!I29","v":0},null,{"$f":"'00'!K29","v":0}]
[{"$f":"'00'!A30","v":0},null,null,0,{"$f":"'00'!E30","v":0},null,{"$f":"'00'!G30","v":0},null,{"$f":"'00'!I30","v":0},null,{"$f":"'00'!K30","v":0}]
[{"$f":"'00'!A31","v":0},null,null,0,{"$f":"'00'!E31","v":0},null,{"$f":"'00'!G31","v":0},null,{"$f":"'00'!I31","v":0},null,{"$f":"'00'!K31","v":0}]
[{"$f":"'00'!A32","v":"Aptitude naturelle"},null,null,0,{"$f":"'00'!E32","v":0},null,{"$f":"'00'!G32","v":0},null,{"$f":"'00'!I32","v":0},null,{"$f":"'00'!K32","v":0}]
[{"$f":"'00'!A33","v":"Gentillesse"},null,null,0,{"$f":"'00'!E33","v":0},null,{"$f":"'00'!G33","v":0},null,{"$f":"'00'!I33","v":0},null,{"$f":"'00'!K33","v":0}]
[{"$f":"'00'!A34","v":"Intelligence de l'execution"},null,null,0,{"$f":"'00'!E34","v":0},null,{"$f":"'00'!G34","v":0},null,{"$f":"'00'!I34","v":0},null,{"$f":"'00'!K34","v":0}]
[{"$f":"'00'!A35","v":"Obéissance"},null,null,0,{"$f":"'00'!E35","v":0},null,{"$f":"'00'!G35","v":0},null,{"$f":"'00'!I35","v":0},null,{"$f":"'00'!K35","v":0}]
["POINTS TOTAL",null,{"$f":"SUM(C16:C35)","v":0},{"$f":"SUM(D16:D35)","v":0},{"$f":"'00'!E36","v":50},null,{"$f":"'00'!G36","v":30},null,{"$f":"'00'!I36","v":0},null,{"$f":"'00'!K36","v":20}]
["Détails des pénéalités ",null,null,"0","Pénalités en Négatif",null,null,null,"RANKING"]
[" POINTS",{"$f":"IF((C36)=0,\"-\",D36+D37)","v":"-"},{"$f":"IF(COUNT(D38:K38)=0,\"-\",D38+F38+H38+J38-B38)","v":"-"},"EVALUATION",null,{"$f":"$L$55","v":"-"},null,null,{"$f":"'Rapport de concours '!N29","v":"X"},null,null,{"$f":"COUNT(S17:S34)","v":0}]
["CACIT / RCACIT  / CACT  / RCACT  :",".",null," <== UPON JUDGE'S DECISION"]
["Observations :  ",null,null,null,null,null,null,null,null,null,null,null,null,null,null,null,0]
[]
[]
[]
[]
[null,null,null,null,null,null,null,null,null,null,null,null,null,null,null,null,48,"IHT1","GUARDING",null,35]
[null,null,null,null,null,null,null,null,null,null,null,null,null,null,null,null,49,"IHT1","MOVING",null,45]
[null,null,null,null,null,null,null,null,null,null,null,null,null,null,null,null,50,"IHT1","DIFFICULT PASS",null,10]
[null,null,null,null,null,null,null,null,null,null,null,null,null,null,null,null,51,"IHT1","BEHAVIOUR",null,10]
[null,null,null,null,null,null,null,null,null,null,null,null,null,null,null,null,52,"IHT2","GUARDING",null,35]
[null,null,null,null,null,null,null,null,null,null,null,null,null,null,null,null,53,"IHT2","MOVING",null,55]
[null,null,null,null,null,null,null,null,null,null,null,null,null,null,null,null,54,"IHT2","DIFFICULT PASS",null,20]
[null,null,null,null,null,null,null,null,null,null,null,null,null,null,null,null,55,"IHT2","BEHAVIOUR",null,10]
[null,null,null,null,null,null,null,null,null,null,null,null,null,null,null,null,56,"IHT3","GUARDING",null,40]
[null,null,null,null,null,null,null,null,null,null,null,null,null,null,null,null,57,"IHT3","MOVING",null,70]
[null,null,null,null,null,null,null,null,null,null,null,{"$f":"IF(B38=\"-\",\"-\",IF(B38>S58,\"EXCELLENT\",IF(B38>T58,\"TRES BON\",IF(B38>U58,\"BON\",IF(B38>V58,\"insuffisant\",IF(B37>0.1,\"insuffisant \",\"éliminé \"))))))","v":"-"},null,null,null,null,58,"IHT3","DIFFICULT PASS",null,30]
[null,null,null,null,null,null,null,null,null,null,null,null,null,null,null,null,59,"IHT3","BEHAVIOUR",null,10]
[]
[null,null,null,null,null,null,null,null,null,null,null,null,null,null,null,null,"IHT1",100,{"$f":"R58*89.999/100","v":89.998999999999995},{"$f":"R58*79.999/100","v":79.998999999999995},{"$f":"R58*69.999/100","v":69.998999999999995},{"$f":"R58*59.999/100","v":59.999000000000002},0.1]
[null,null,null,null,null,null,null,null,null,null,null,null,null,null,null,null,"iIHT2",120,{"$f":"R59*89.999/100","v":107.99879999999999},{"$f":"R59*79.999/100","v":95.998799999999989},{"$f":"R59*69.999/100","v":83.998799999999989},{"$f":"R59*59.999/100","v":71.998800000000003},0.1]
[null,null,null,null,null,null,null,null,null,null,null,null,null,null,null,null,"IHT3",150,134.99849999999998,{"$f":"R60*79.999/100","v":119.99849999999998},{"$f":"R60*69.999/100","v":104.99849999999998},{"$f":"R60*59.999/100","v":89.998500000000007},0.1]

{"sheet":"14","index":19,"n_rows":60,"n_cols":23,"rows_kept":60,"cut":false,"hidden":false,"merged":[[2,1,2,10],[4,6,4,8],[6,2,6,3],[6,4,6,10],[7,4,7,10],[8,2,8,3],[8,4,8,10],[13,0,13,1],[13,2,13,3],[13,4,13,5],[13,6,13,7],[13,8,13,9],[13,10,13,11],[9,2,9,3],[9,4,9,10],[10,2,10,3],[10,4,10,10],[11,2,11,3],[11,4,11,10],[14,4,14,5],[14,6,14,7],[14,8,14,9],[14,10,14,11],[15,4,15,5],[15,6,15,7],[15,8,15,9],[15,10,15,11],[12,4,12,10],[18,4,18,5],[18,6,18,7],[18,8,18,9],[18,10,18,11],[19,4,19,5],[19,6,19,7],[19,8,19,9],[19,10,19,11],[16,4,16,5],[16,6,16,7],[16,8,16,9],[16,10,16,11],[17,4,17,5],[17,6,17,7],[17,8,17,9],[17,10,17,11],[22,4,22,5],[22,6,22,7],[22,8,22,9],[22,10,22,11],[23,4,23,5],[23,6,23,7],[23,8,23,9],[23,10,23,11],[20,4,20,5],[20,6,20,7],[20,8,20,9],[20,10,20,11],[21,4,21,5],[21,6,21,7],[21,8,21,9],[21,10,21,11],[26,4,26,5],[26,6,26,7],[26,8,26,9],[26,10,26,11],[27,4,27,5],[27,6,27,7],[27,8,27,9],[27,10,27,11],[24,4,24,5],[24,6,24,7],[24,8,24,9],[24,10,24,11],[25,4,25,5],[25,6,25,7],[25,8,25,9],[25,10,25,11],[30,4,30,5],[30,6,30,7],[30,8,30,9],[30,10,30,11],[31,4,31,5],[31,6,31,7],[31,8,31,9],[31,10,31,11],[28,4,28,5],[28,6,28,7],[28,8,28,9],[28,10,28,11],[29,4,29,5],[29,6,29,7],[29,8,29,9],[29,10,29,11],[34,4,34,5],[34,6,34,7],[34,8,34,9],[34,10,34,11],[35,4,35,5],[35,6,35,7],[35,8,35,9],[35,10,35,11],[32,4,32,5],[32,6,32,7],[32,8,32,9],[32,10,32,11],[33,4,33,5],[33,6,33,7],[33,8,33,9],[33,10,33,11],[38,1,38,2],[38,3,38,11],[39,1,39,11],[44,18,44,19],[45,18,45,19],[46,18,46,19],[36,1,36,2],[36,4,36,7],[36,8,36,11],[37,1,37,2],[37,3,37,4],[37,5,37,7],[37,8,37,10],[53,18,53,19],[54,18,54,19],[55,18,55,19],[47,18,47,19],[48,18,48,19],[49,18,49,19],[50,18,50,19],[51,18,51,19],[52,18,52,19]]}
[null,null,null,null,null,null,"IHT TS","HWT"]
[]
[]
[]
[null,"IHT TS ",null,null,null,null,"COUNTRY LOGO"]
["Organisation",{"$f":"'Fiche organisateur N2'!F5","v":0}]
["Ville",{"$f":"'Fiche organisateur N2'!F6","v":0},"Date : ",null,{"$f":"'Fiche organisateur N2'!$H$8","v":0}]
["Contact : ",0]
["Propriètaire",{"$f":"'Fiche organisateur N2'!$C$30","v":0},"Race et sexe",null,{"$f":"'Fiche organisateur N2'!$G$30","v":0}]
["Conducteur",{"$f":"'Fiche organisateur N2'!$D$30","v":0},"Né",null,{"$f":"'Fiche organisateur N2'!$K$30","v":0}]
["Nom du chien",{"$f":"'Fiche organisateur N2'!$E$30","v":0},"PEDIGREE",null,{"$f":"'Fiche organisateur N2'!$J$30","v":0}]
["Affixe",{"$f":"'Fiche organisateur N2'!$F$30","v":0},"Identifiant ",null,{"$f":"'Fiche organisateur N2'!$L$30","v":0}]
[]
["for the country--->"]
["EXERCISES ","OBSERVATIONS","Mini","SCORE","GUARDING",null,"MOVING",null,"DIFFICULT PASSAGES",null,"BEHAVIOUR"]
[{"$f":"'00'!A16","v":0},null,null,{"$f":"IF(COUNT(E16:L16)=0,\"-\",E16+G16+I16+K16-C16)","v":0},{"$f":"'00'!E16","v":0},null,{"$f":"'00'!G16","v":0},null,{"$f":"'00'!I16","v":0},null,{"$f":"'00'!K16","v":0}]
[0,null,null,0,{"$f":"'00'!E17","v":0},null,{"$f":"'00'!G17","v":0},null,{"$f":"'00'!I17","v":0},null,{"$f":"'00'!K17","v":0}]
[{"$f":"'00'!A18","v":0},null,null,0,{"$f":"'00'!E18","v":0},null,{"$f":"'00'!G18","v":0},null,{"$f":"'00'!I18","v":0},null,{"$f":"'00'!K18","v":0}]
[{"$f":"'00'!A19","v":0},null,null,0,{"$f":"'00'!E19","v":0},null,{"$f":"'00'!G19","v":0},null,{"$f":"'00'!I19","v":0},null,{"$f":"'00'!K19","v":0}]
[{"$f":"'00'!A20","v":0},null,null,0,{"$f":"'00'!E20","v":0},null,{"$f":"'00'!G20","v":0},null,{"$f":"'00'!I20","v":0},null,{"$f":"'00'!K20","v":0}]
[{"$f":"'00'!A21","v":0},null,null,0,{"$f":"'00'!E21","v":0},null,{"$f":"'00'!G21","v":0},null,{"$f":"'00'!I21","v":0},null,{"$f":"'00'!K21","v":0}]
[{"$f":"'00'!A22","v":0},null,null,0,{"$f":"'00'!E22","v":0},null,{"$f":"'00'!G22","v":0},null,{"$f":"'00'!I22","v":0},null,{"$f":"'00'!K22","v":0}]
[{"$f":"'00'!A23","v":0},null,null,0,{"$f":"'00'!E23","v":0},null,{"$f":"'00'!G23","v":0},null,{"$f":"'00'!I23","v":0},null,{"$f":"'00'!K23","v":0}]
[{"$f":"'00'!A24","v":0},null,null,0,{"$f":"'00'!E24","v":0},null,{"$f":"'00'!G24","v":0},null,{"$f":"'00'!I24","v":0},null,{"$f":"'00'!K24","v":0}]
[{"$f":"'00'!A25","v":0},null,null,0,{"$f":"'00'!E25","v":0},null,{"$f":"'00'!G25","v":0},null,{"$f":"'00'!I25","v":0},null,{"$f":"'00'!K25","v":0}]
[{"$f":"'00'!A26","v":0},null,null,0,{"$f":"'00'!E26","v":0},null,{"$f":"'00'!G26","v":0},null,{"$f":"'00'!I26","v":0},null,{"$f":"'00'!K26","v":0}]
[{"$f":"'00'!A27","v":0},null,null,0,{"$f":"'00'!E27","v":0},null,{"$f":"'00'!G27","v":0},null,{"$f":"'00'!I27","v":0},null,{"$f":"'00'!K27","v":0}]
[{"$f":"'00'!A28","v":0},null,null,0,{"$f":"'00'!E28","v":0},null,{"$f":"'00'!G28","v":0},null,{"$f":"'00'!I28","v":0},null,{"$f":"'00'!K28","v":0}]
[{"$f":"'00'!A29","v":0},null,null,0,{"$f":"'00'!E29","v":0},null,{"$f":"'00'!G29","v":0},null,{"$f":"'00'!I29","v":0},null,{"$f":"'00'!K29","v":0}]
[{"$f":"'00'!A30","v":0},null,null,0,{"$f":"'00'!E30","v":0},null,{"$f":"'00'!G30","v":0},null,{"$f":"'00'!I30","v":0},null,{"$f":"'00'!K30","v":0}]
[{"$f":"'00'!A31","v":0},null,null,0,{"$f":"'00'!E31","v":0},null,{"$f":"'00'!G31","v":0},null,{"$f":"'00'!I31","v":0},null,{"$f":"'00'!K31","v":0}]
[{"$f":"'00'!A32","v":"Aptitude naturelle"},null,null,0,{"$f":"'00'!E32","v":0},null,{"$f":"'00'!G32","v":0},null,{"$f":"'00'!I32","v":0},null,{"$f":"'00'!K32","v":0}]
[{"$f":"'00'!A33","v":"Gentillesse"},null,null,0,{"$f":"'00'!E33","v":0},null,{"$f":"'00'!G33","v":0},null,{"$f":"'00'!I33","v":0},null,{"$f":"'00'!K33","v":0}]
[{"$f":"'00'!A34","v":"Intelligence de l'execution"},null,null,0,{"$f":"'00'!E34","v":0},null,{"$f":"'00'!G34","v":0},null,{"$f":"'00'!I34","v":0},null,{"$f":"'00'!K34","v":0}]
[{"$f":"'00'!A35","v":"Obéissance"},null,null,0,{"$f":"'00'!E35","v":0},null,{"$f":"'00'!G35","v":0},null,{"$f":"'00'!I35","v":0},null,{"$f":"'00'!K35","v":0}]
["POINTS TOTAL",null,{"$f":"SUM(C16:C35)","v":0},{"$f":"SUM(D16:D35)","v":0},{"$f":"'00'!E36","v":50},null,{"$f":"'00'!G36","v":30},null,{"$f":"'00'!I36","v":0},null,{"$f":"'00'!K36","v":20}]
["Détails des pénéalités ",null,null,"0","Pénalités en Négatif",null,null,null,"RANKING"]
[" POINTS",{"$f":"IF((C36)=0,\"-\",D36+D37)","v":"-"},{"$f":"IF(COUNT(D38:K38)=0,\"-\",D38+F38+H38+J38-B38)","v":"-"},"EVALUATION",null,{"$f":"$L$55","v":"-"},null,null,{"$f":"'Rapport de concours '!N30","v":"X"},null,null,{"$f":"COUNT(S17:S34)","v":0}]
["CACIT / RCACIT  / CACT  / RCACT  :",".",null," <== UPON JUDGE'S DECISION"]
["Observations :  ",null,null,null,null,null,null,null,null,null,null,null,null,null,null,null,0]
[]
[]
[]
[]
[null,null,null,null,null,null,null,null,null,null,null,null,null,null,null,null,48,"IHT1","GUARDING",null,35]
[null,null,null,null,null,null,null,null,null,null,null,null,null,null,null,null,49,"IHT1","MOVING",null,45]
[null,null,null,null,null,null,null,null,null,null,null,null,null,null,null,null,50,"IHT1","DIFFICULT PASS",null,10]
[null,null,null,null,null,null,null,null,null,null,null,null,null,null,null,null,51,"IHT1","BEHAVIOUR",null,10]
[null,null,null,null,null,null,null,null,null,null,null,null,null,null,null,null,52,"IHT2","GUARDING",null,35]
[null,null,null,null,null,null,null,null,null,null,null,null,null,null,null,null,53,"IHT2","MOVING",null,55]
[null,null,null,null,null,null,null,null,null,null,null,null,null,null,null,null,54,"IHT2","DIFFICULT PASS",null,20]
[null,null,null,null,null,null,null,null,null,null,null,null,null,null,null,null,55,"IHT2","BEHAVIOUR",null,10]
[null,null,null,null,null,null,null,null,null,null,null,null,null,null,null,null,56,"IHT3","GUARDING",null,40]
[null,null,null,null,null,null,null,null,null,null,null,null,null,null,null,null,57,"IHT3","MOVING",null,70]
[null,null,null,null,null,null,null,null,null,null,null,{"$f":"IF(B38=\"-\",\"-\",IF(B38>S58,\"EXCELLENT\",IF(B38>T58,\"TRES BON\",IF(B38>U58,\"BON\",IF(B38>V58,\"insuffisant\",IF(B37>0.1,\"insuffisant \",\"éliminé \"))))))","v":"-"},null,null,null,null,58,"IHT3","DIFFICULT PASS",null,30]
[null,null,null,null,null,null,null,null,null,null,null,null,null,null,null,null,59,"IHT3","BEHAVIOUR",null,10]
[]
[null,null,null,null,null,null,null,null,null,null,null,null,null,null,null,null,"IHT1",100,{"$f":"R58*89.999/100","v":89.998999999999995},{"$f":"R58*79.999/100","v":79.998999999999995},{"$f":"R58*69.999/100","v":69.998999999999995},{"$f":"R58*59.999/100","v":59.999000000000002},0.1]
[null,null,null,null,null,null,null,null,null,null,null,null,null,null,null,null,"iIHT2",120,{"$f":"R59*89.999/100","v":107.99879999999999},{"$f":"R59*79.999/100","v":95.998799999999989},{"$f":"R59*69.999/100","v":83.998799999999989},{"$f":"R59*59.999/100","v":71.998800000000003},0.1]
[null,null,null,null,null,null,null,null,null,null,null,null,null,null,null,null,"IHT3",150,134.99849999999998,{"$f":"R60*79.999/100","v":119.99849999999998},{"$f":"R60*69.999/100","v":104.99849999999998},{"$f":"R60*59.999/100","v":89.998500000000007},0.1]

{"sheet":"15","index":20,"n_rows":60,"n_cols":23,"rows_kept":60,"cut":false,"hidden":false,"merged":[[2,1,2,10],[4,6,4,8],[6,2,6,3],[6,4,6,10],[7,4,7,10],[8,2,8,3],[8,4,8,10],[13,0,13,1],[13,2,13,3],[13,4,13,5],[13,6,13,7],[13,8,13,9],[13,10,13,11],[9,2,9,3],[9,4,9,10],[10,2,10,3],[10,4,10,10],[11,2,11,3],[11,4,11,10],[14,4,14,5],[14,6,14,7],[14,8,14,9],[14,10,14,11],[15,4,15,5],[15,6,15,7],[15,8,15,9],[15,10,15,11],[12,4,12,10],[18,4,18,5],[18,6,18,7],[18,8,18,9],[18,10,18,11],[19,4,19,5],[19,6,19,7],[19,8,19,9],[19,10,19,11],[16,4,16,5],[16,6,16,7],[16,8,16,9],[16,10,16,11],[17,4,17,5],[17,6,17,7],[17,8,17,9],[17,10,17,11],[22,4,22,5],[22,6,22,7],[22,8,22,9],[22,10,22,11],[23,4,23,5],[23,6,23,7],[23,8,23,9],[23,10,23,11],[20,4,20,5],[20,6,20,7],[20,8,20,9],[20,10,20,11],[21,4,21,5],[21,6,21,7],[21,8,21,9],[21,10,21,11],[26,4,26,5],[26,6,26,7],[26,8,26,9],[26,10,26,11],[27,4,27,5],[27,6,27,7],[27,8,27,9],[27,10,27,11],[24,4,24,5],[24,6,24,7],[24,8,24,9],[24,10,24,11],[25,4,25,5],[25,6,25,7],[25,8,25,9],[25,10,25,11],[30,4,30,5],[30,6,30,7],[30,8,30,9],[30,10,30,11],[31,4,31,5],[31,6,31,7],[31,8,31,9],[31,10,31,11],[28,4,28,5],[28,6,28,7],[28,8,28,9],[28,10,28,11],[29,4,29,5],[29,6,29,7],[29,8,29,9],[29,10,29,11],[34,4,34,5],[34,6,34,7],[34,8,34,9],[34,10,34,11],[35,4,35,5],[35,6,35,7],[35,8,35,9],[35,10,35,11],[32,4,32,5],[32,6,32,7],[32,8,32,9],[32,10,32,11],[33,4,33,5],[33,6,33,7],[33,8,33,9],[33,10,33,11],[38,1,38,2],[38,3,38,11],[39,1,39,11],[44,18,44,19],[45,18,45,19],[46,18,46,19],[36,1,36,2],[36,4,36,7],[36,8,36,11],[37,1,37,2],[37,3,37,4],[37,5,37,7],[37,8,37,10],[53,18,53,19],[54,18,54,19],[55,18,55,19],[47,18,47,19],[48,18,48,19],[49,18,49,19],[50,18,50,19],[51,18,51,19],[52,18,52,19]]}
[null,null,null,null,null,null,"IHT TS","HWT"]
[]
[]
[]
[null,"IHT TS ",null,null,null,null,"COUNTRY LOGO"]
["Organisation",{"$f":"'Fiche organisateur N2'!F5","v":0}]
["Ville",{"$f":"'Fiche organisateur N2'!F6","v":0},"Date : ",null,{"$f":"'Fiche organisateur N2'!$H$8","v":0}]
["Contact : ",0]
["Propriètaire",{"$f":"'Fiche organisateur N2'!$C$31","v":0},"Race et sexe",null,{"$f":"'Fiche organisateur N2'!$G$31","v":0}]
["Conducteur",{"$f":"'Fiche organisateur N2'!$D$31","v":0},"Né",null,{"$f":"'Fiche organisateur N2'!$K$31","v":0}]
["Nom du chien",{"$f":"'Fiche organisateur N2'!$E$31","v":0},"PEDIGREE",null,{"$f":"'Fiche organisateur N2'!$J$31","v":0}]
["Affixe",{"$f":"'Fiche organisateur N2'!$F$31","v":0},"Identifiant ",null,{"$f":"'Fiche organisateur N2'!$L$31","v":0}]
[]
["for the country--->"]
["EXERCISES ","OBSERVATIONS","Mini","SCORE","GUARDING",null,"MOVING",null,"DIFFICULT PASSAGES",null,"BEHAVIOUR"]
[{"$f":"'00'!A16","v":0},null,null,{"$f":"IF(COUNT(E16:L16)=0,\"-\",E16+G16+I16+K16-C16)","v":0},{"$f":"'00'!E16","v":0},null,{"$f":"'00'!G16","v":0},null,{"$f":"'00'!I16","v":0},null,{"$f":"'00'!K16","v":0}]
[0,null,null,0,{"$f":"'00'!E17","v":0},null,{"$f":"'00'!G17","v":0},null,{"$f":"'00'!I17","v":0},null,{"$f":"'00'!K17","v":0}]
[{"$f":"'00'!A18","v":0},null,null,0,{"$f":"'00'!E18","v":0},null,{"$f":"'00'!G18","v":0},null,{"$f":"'00'!I18","v":0},null,{"$f":"'00'!K18","v":0}]
[{"$f":"'00'!A19","v":0},null,null,0,{"$f":"'00'!E19","v":0},null,{"$f":"'00'!G19","v":0},null,{"$f":"'00'!I19","v":0},null,{"$f":"'00'!K19","v":0}]
[{"$f":"'00'!A20","v":0},null,null,0,{"$f":"'00'!E20","v":0},null,{"$f":"'00'!G20","v":0},null,{"$f":"'00'!I20","v":0},null,{"$f":"'00'!K20","v":0}]
[{"$f":"'00'!A21","v":0},null,null,0,{"$f":"'00'!E21","v":0},null,{"$f":"'00'!G21","v":0},null,{"$f":"'00'!I21","v":0},null,{"$f":"'00'!K21","v":0}]
[{"$f":"'00'!A22","v":0},null,null,0,{"$f":"'00'!E22","v":0},null,{"$f":"'00'!G22","v":0},null,{"$f":"'00'!I22","v":0},null,{"$f":"'00'!K22","v":0}]
[{"$f":"'00'!A23","v":0},null,null,0,{"$f":"'00'!E23","v":0},null,{"$f":"'00'!G23","v":0},null,{"$f":"'00'!I23","v":0},null,{"$f":"'00'!K23","v":0}]
[{"$f":"'00'!A24","v":0},null,null,0,{"$f":"'00'!E24","v":0},null,{"$f":"'00'!G24","v":0},null,{"$f":"'00'!I24","v":0},null,{"$f":"'00'!K24","v":0}]
[{"$f":"'00'!A25","v":0},null,null,0,{"$f":"'00'!E25","v":0},null,{"$f":"'00'!G25","v":0},null,{"$f":"'00'!I25","v":0},null,{"$f":"'00'!K25","v":0}]
[{"$f":"'00'!A26","v":0},null,null,0,{"$f":"'00'!E26","v":0},null,{"$f":"'00'!G26","v":0},null,{"$f":"'00'!I26","v":0},null,{"$f":"'00'!K26","v":0}]
[{"$f":"'00'!A27","v":0},null,null,0,{"$f":"'00'!E27","v":0},null,{"$f":"'00'!G27","v":0},null,{"$f":"'00'!I27","v":0},null,{"$f":"'00'!K27","v":0}]
[{"$f":"'00'!A28","v":0},null,null,0,{"$f":"'00'!E28","v":0},null,{"$f":"'00'!G28","v":0},null,{"$f":"'00'!I28","v":0},null,{"$f":"'00'!K28","v":0}]
[{"$f":"'00'!A29","v":0},null,null,0,{"$f":"'00'!E29","v":0},null,{"$f":"'00'!G29","v":0},null,{"$f":"'00'!I29","v":0},null,{"$f":"'00'!K29","v":0}]
[{"$f":"'00'!A30","v":0},null,null,0,{"$f":"'00'!E30","v":0},null,{"$f":"'00'!G30","v":0},null,{"$f":"'00'!I30","v":0},null,{"$f":"'00'!K30","v":0}]
[{"$f":"'00'!A31","v":0},null,null,0,{"$f":"'00'!E31","v":0},null,{"$f":"'00'!G31","v":0},null,{"$f":"'00'!I31","v":0},null,{"$f":"'00'!K31","v":0}]
[{"$f":"'00'!A32","v":"Aptitude naturelle"},null,null,0,{"$f":"'00'!E32","v":0},null,{"$f":"'00'!G32","v":0},null,{"$f":"'00'!I32","v":0},null,{"$f":"'00'!K32","v":0}]
[{"$f":"'00'!A33","v":"Gentillesse"},null,null,0,{"$f":"'00'!E33","v":0},null,{"$f":"'00'!G33","v":0},null,{"$f":"'00'!I33","v":0},null,{"$f":"'00'!K33","v":0}]
[{"$f":"'00'!A34","v":"Intelligence de l'execution"},null,null,0,{"$f":"'00'!E34","v":0},null,{"$f":"'00'!G34","v":0},null,{"$f":"'00'!I34","v":0},null,{"$f":"'00'!K34","v":0}]
[{"$f":"'00'!A35","v":"Obéissance"},null,null,0,{"$f":"'00'!E35","v":0},null,{"$f":"'00'!G35","v":0},null,{"$f":"'00'!I35","v":0},null,{"$f":"'00'!K35","v":0}]
["POINTS TOTAL",null,{"$f":"SUM(C16:C35)","v":0},{"$f":"SUM(D16:D35)","v":0},{"$f":"'00'!E36","v":50},null,{"$f":"'00'!G36","v":30},null,{"$f":"'00'!I36","v":0},null,{"$f":"'00'!K36","v":20}]
["Détails des pénéalités ",null,null,"0","Pénalités en Négatif",null,null,null,"RANKING"]
[" POINTS",{"$f":"IF((C36)=0,\"-\",D36+D37)","v":"-"},{"$f":"IF(COUNT(D38:K38)=0,\"-\",D38+F38+H38+J38-B38)","v":"-"},"EVALUATION",null,{"$f":"$L$55","v":"-"},null,null,{"$f":"'Rapport de concours '!N31","v":"X"},null,null,{"$f":"COUNT(S17:S34)","v":0}]
["CACIT / RCACIT  / CACT  / RCACT  :",".",null," <== UPON JUDGE'S DECISION"]
["Observations :  ",null,null,null,null,null,null,null,null,null,null,null,null,null,null,null,0]
[]
[]
[]
[]
[null,null,null,null,null,null,null,null,null,null,null,null,null,null,null,null,48,"IHT1","GUARDING",null,35]
[null,null,null,null,null,null,null,null,null,null,null,null,null,null,null,null,49,"IHT1","MOVING",null,45]
[null,null,null,null,null,null,null,null,null,null,null,null,null,null,null,null,50,"IHT1","DIFFICULT PASS",null,10]
[null,null,null,null,null,null,null,null,null,null,null,null,null,null,null,null,51,"IHT1","BEHAVIOUR",null,10]
[null,null,null,null,null,null,null,null,null,null,null,null,null,null,null,null,52,"IHT2","GUARDING",null,35]
[null,null,null,null,null,null,null,null,null,null,null,null,null,null,null,null,53,"IHT2","MOVING",null,55]
[null,null,null,null,null,null,null,null,null,null,null,null,null,null,null,null,54,"IHT2","DIFFICULT PASS",null,20]
[null,null,null,null,null,null,null,null,null,null,null,null,null,null,null,null,55,"IHT2","BEHAVIOUR",null,10]
[null,null,null,null,null,null,null,null,null,null,null,null,null,null,null,null,56,"IHT3","GUARDING",null,40]
[null,null,null,null,null,null,null,null,null,null,null,null,null,null,null,null,57,"IHT3","MOVING",null,70]
[null,null,null,null,null,null,null,null,null,null,null,{"$f":"IF(B38=\"-\",\"-\",IF(B38>S58,\"EXCELLENT\",IF(B38>T58,\"TRES BON\",IF(B38>U58,\"BON\",IF(B38>V58,\"insuffisant\",IF(B37>0.1,\"insuffisant \",\"éliminé \"))))))","v":"-"},null,null,null,null,58,"IHT3","DIFFICULT PASS",null,30]
[null,null,null,null,null,null,null,null,null,null,null,null,null,null,null,null,59,"IHT3","BEHAVIOUR",null,10]
[]
[null,null,null,null,null,null,null,null,null,null,null,null,null,null,null,null,"IHT1",100,{"$f":"R58*89.999/100","v":89.998999999999995},{"$f":"R58*79.999/100","v":79.998999999999995},{"$f":"R58*69.999/100","v":69.998999999999995},{"$f":"R58*59.999/100","v":59.999000000000002},0.1]
[null,null,null,null,null,null,null,null,null,null,null,null,null,null,null,null,"iIHT2",120,{"$f":"R59*89.999/100","v":107.99879999999999},{"$f":"R59*79.999/100","v":95.998799999999989},{"$f":"R59*69.999/100","v":83.998799999999989},{"$f":"R59*59.999/100","v":71.998800000000003},0.1]
[null,null,null,null,null,null,null,null,null,null,null,null,null,null,null,null,"IHT3",150,134.99849999999998,{"$f":"R60*79.999/100","v":119.99849999999998},{"$f":"R60*69.999/100","v":104.99849999999998},{"$f":"R60*59.999/100","v":89.998500000000007},0.1]

{"sheet":"16","index":21,"n_rows":60,"n_cols":23,"rows_kept":60,"cut":false,"hidden":false,"merged":[[2,1,2,10],[4,6,4,8],[6,2,6,3],[6,4,6,10],[7,4,7,10],[8,2,8,3],[8,4,8,10],[13,0,13,1],[13,2,13,3],[13,4,13,5],[13,6,13,7],[13,8,13,9],[13,10,13,11],[9,2,9,3],[9,4,9,10],[10,2,10,3],[10,4,10,10],[11,2,11,3],[11,4,11,10],[14,4,14,5],[14,6,14,7],[14,8,14,9],[14,10,14,11],[15,4,15,5],[15,6,15,7],[15,8,15,9],[15,10,15,11],[12,4,12,10],[18,4,18,5],[18,6,18,7],[18,8,18,9],[18,10,18,11],[19,4,19,5],[19,6,19,7],[19,8,19,9],[19,10,19,11],[16,4,16,5],[16,6,16,7],[16,8,16,9],[16,10,16,11],[17,4,17,5],[17,6,17,7],[17,8,17,9],[17,10,17,11],[22,4,22,5],[22,6,22,7],[22,8,22,9],[22,10,22,11],[23,4,23,5],[23,6,23,7],[23,8,23,9],[23,10,23,11],[20,4,20,5],[20,6,20,7],[20,8,20,9],[20,10,20,11],[21,4,21,5],[21,6,21,7],[21,8,21,9],[21,10,21,11],[26,4,26,5],[26,6,26,7],[26,8,26,9],[26,10,26,11],[27,4,27,5],[27,6,27,7],[27,8,27,9],[27,10,27,11],[24,4,24,5],[24,6,24,7],[24,8,24,9],[24,10,24,11],[25,4,25,5],[25,6,25,7],[25,8,25,9],[25,10,25,11],[30,4,30,5],[30,6,30,7],[30,8,30,9],[30,10,30,11],[31,4,31,5],[31,6,31,7],[31,8,31,9],[31,10,31,11],[28,4,28,5],[28,6,28,7],[28,8,28,9],[28,10,28,11],[29,4,29,5],[29,6,29,7],[29,8,29,9],[29,10,29,11],[34,4,34,5],[34,6,34,7],[34,8,34,9],[34,10,34,11],[35,4,35,5],[35,6,35,7],[35,8,35,9],[35,10,35,11],[32,4,32,5],[32,6,32,7],[32,8,32,9],[32,10,32,11],[33,4,33,5],[33,6,33,7],[33,8,33,9],[33,10,33,11],[38,1,38,2],[38,3,38,11],[39,1,39,11],[44,18,44,19],[45,18,45,19],[46,18,46,19],[36,1,36,2],[36,4,36,7],[36,8,36,11],[37,1,37,2],[37,3,37,4],[37,5,37,7],[37,8,37,10],[53,18,53,19],[54,18,54,19],[55,18,55,19],[47,18,47,19],[48,18,48,19],[49,18,49,19],[50,18,50,19],[51,18,51,19],[52,18,52,19]]}
[null,null,null,null,null,null,"IHT TS","HWT"]
[]
[]
[]
[null,"IHT TS ",null,null,null,null,"COUNTRY LOGO"]
["Organisation",{"$f":"'Fiche organisateur N2'!F5","v":0}]
["Ville",{"$f":"'Fiche organisateur N2'!F6","v":0},"Date : ",null,{"$f":"'Fiche organisateur N2'!$H$8","v":0}]
["Contact : ",0]
["Propriètaire",{"$f":"'Fiche organisateur N2'!$C$32","v":0},"Race et sexe",null,{"$f":"'Fiche organisateur N2'!$G$32","v":0}]
["Conducteur",{"$f":"'Fiche organisateur N2'!$D$32","v":0},"Né",null,{"$f":"'Fiche organisateur N2'!$K$32","v":0}]
["Nom du chien",{"$f":"'Fiche organisateur N2'!$E$32","v":0},"PEDIGREE",null,{"$f":"'Fiche organisateur N2'!$J$32","v":0}]
["Affixe",{"$f":"'Fiche organisateur N2'!$F$32","v":0},"Identifiant ",null,{"$f":"'Fiche organisateur N2'!$L$32","v":0}]
[]
["for the country--->"]
["EXERCISES ","OBSERVATIONS","Mini","SCORE","GUARDING",null,"MOVING",null,"DIFFICULT PASSAGES",null,"BEHAVIOUR"]
[{"$f":"'00'!A16","v":0},null,null,{"$f":"IF(COUNT(E16:L16)=0,\"-\",E16+G16+I16+K16-C16)","v":0},{"$f":"'00'!E16","v":0},null,{"$f":"'00'!G16","v":0},null,{"$f":"'00'!I16","v":0},null,{"$f":"'00'!K16","v":0}]
[0,null,null,0,{"$f":"'00'!E17","v":0},null,{"$f":"'00'!G17","v":0},null,{"$f":"'00'!I17","v":0},null,{"$f":"'00'!K17","v":0}]
[{"$f":"'00'!A18","v":0},null,null,0,{"$f":"'00'!E18","v":0},null,{"$f":"'00'!G18","v":0},null,{"$f":"'00'!I18","v":0},null,{"$f":"'00'!K18","v":0}]
[{"$f":"'00'!A19","v":0},null,null,0,{"$f":"'00'!E19","v":0},null,{"$f":"'00'!G19","v":0},null,{"$f":"'00'!I19","v":0},null,{"$f":"'00'!K19","v":0}]
[{"$f":"'00'!A20","v":0},null,null,0,{"$f":"'00'!E20","v":0},null,{"$f":"'00'!G20","v":0},null,{"$f":"'00'!I20","v":0},null,{"$f":"'00'!K20","v":0}]
[{"$f":"'00'!A21","v":0},null,null,0,{"$f":"'00'!E21","v":0},null,{"$f":"'00'!G21","v":0},null,{"$f":"'00'!I21","v":0},null,{"$f":"'00'!K21","v":0}]
[{"$f":"'00'!A22","v":0},null,null,0,{"$f":"'00'!E22","v":0},null,{"$f":"'00'!G22","v":0},null,{"$f":"'00'!I22","v":0},null,{"$f":"'00'!K22","v":0}]
[{"$f":"'00'!A23","v":0},null,null,0,{"$f":"'00'!E23","v":0},null,{"$f":"'00'!G23","v":0},null,{"$f":"'00'!I23","v":0},null,{"$f":"'00'!K23","v":0}]
[{"$f":"'00'!A24","v":0},null,null,0,{"$f":"'00'!E24","v":0},null,{"$f":"'00'!G24","v":0},null,{"$f":"'00'!I24","v":0},null,{"$f":"'00'!K24","v":0}]
[{"$f":"'00'!A25","v":0},null,null,0,{"$f":"'00'!E25","v":0},null,{"$f":"'00'!G25","v":0},null,{"$f":"'00'!I25","v":0},null,{"$f":"'00'!K25","v":0}]
[{"$f":"'00'!A26","v":0},null,null,0,{"$f":"'00'!E26","v":0},null,{"$f":"'00'!G26","v":0},null,{"$f":"'00'!I26","v":0},null,{"$f":"'00'!K26","v":0}]
[{"$f":"'00'!A27","v":0},null,null,0,{"$f":"'00'!E27","v":0},null,{"$f":"'00'!G27","v":0},null,{"$f":"'00'!I27","v":0},null,{"$f":"'00'!K27","v":0}]
[{"$f":"'00'!A28","v":0},null,null,0,{"$f":"'00'!E28","v":0},null,{"$f":"'00'!G28","v":0},null,{"$f":"'00'!I28","v":0},null,{"$f":"'00'!K28","v":0}]
[{"$f":"'00'!A29","v":0},null,null,0,{"$f":"'00'!E29","v":0},null,{"$f":"'00'!G29","v":0},null,{"$f":"'00'!I29","v":0},null,{"$f":"'00'!K29","v":0}]
[{"$f":"'00'!A30","v":0},null,null,0,{"$f":"'00'!E30","v":0},null,{"$f":"'00'!G30","v":0},null,{"$f":"'00'!I30","v":0},null,{"$f":"'00'!K30","v":0}]
[{"$f":"'00'!A31","v":0},null,null,0,{"$f":"'00'!E31","v":0},null,{"$f":"'00'!G31","v":0},null,{"$f":"'00'!I31","v":0},null,{"$f":"'00'!K31","v":0}]
[{"$f":"'00'!A32","v":"Aptitude naturelle"},null,null,0,{"$f":"'00'!E32","v":0},null,{"$f":"'00'!G32","v":0},null,{"$f":"'00'!I32","v":0},null,{"$f":"'00'!K32","v":0}]
[{"$f":"'00'!A33","v":"Gentillesse"},null,null,0,{"$f":"'00'!E33","v":0},null,{"$f":"'00'!G33","v":0},null,{"$f":"'00'!I33","v":0},null,{"$f":"'00'!K33","v":0}]
[{"$f":"'00'!A34","v":"Intelligence de l'execution"},null,null,0,{"$f":"'00'!E34","v":0},null,{"$f":"'00'!G34","v":0},null,{"$f":"'00'!I34","v":0},null,{"$f":"'00'!K34","v":0}]
[{"$f":"'00'!A35","v":"Obéissance"},null,null,0,{"$f":"'00'!E35","v":0},null,{"$f":"'00'!G35","v":0},null,{"$f":"'00'!I35","v":0},null,{"$f":"'00'!K35","v":0}]
["POINTS TOTAL",null,{"$f":"SUM(C16:C35)","v":0},{"$f":"SUM(D16:D35)","v":0},{"$f":"'00'!E36","v":50},null,{"$f":"'00'!G36","v":30},null,{"$f":"'00'!I36","v":0},null,{"$f":"'00'!K36","v":20}]
["Détails des pénéalités ",null,null,"0","Pénalités en Négatif",null,null,null,"RANKING"]
[" POINTS",{"$f":"IF((C36)=0,\"-\",D36+D37)","v":"-"},{"$f":"IF(COUNT(D38:K38)=0,\"-\",D38+F38+H38+J38-B38)","v":"-"},"EVALUATION",null,{"$f":"$L$55","v":"-"},null,null,{"$f":"'Rapport de concours '!N32","v":"X"},null,null,{"$f":"COUNT(S17:S34)","v":0}]
["CACIT / RCACIT  / CACT  / RCACT  :",".",null," <== UPON JUDGE'S DECISION"]
["Observations :  ",null,null,null,null,null,null,null,null,null,null,null,null,null,null,null,0]
[]
[]
[]
[]
[null,null,null,null,null,null,null,null,null,null,null,null,null,null,null,null,48,"IHT1","GUARDING",null,35]
[null,null,null,null,null,null,null,null,null,null,null,null,null,null,null,null,49,"IHT1","MOVING",null,45]
[null,null,null,null,null,null,null,null,null,null,null,null,null,null,null,null,50,"IHT1","DIFFICULT PASS",null,10]
[null,null,null,null,null,null,null,null,null,null,null,null,null,null,null,null,51,"IHT1","BEHAVIOUR",null,10]
[null,null,null,null,null,null,null,null,null,null,null,null,null,null,null,null,52,"IHT2","GUARDING",null,35]
[null,null,null,null,null,null,null,null,null,null,null,null,null,null,null,null,53,"IHT2","MOVING",null,55]
[null,null,null,null,null,null,null,null,null,null,null,null,null,null,null,null,54,"IHT2","DIFFICULT PASS",null,20]
[null,null,null,null,null,null,null,null,null,null,null,null,null,null,null,null,55,"IHT2","BEHAVIOUR",null,10]
[null,null,null,null,null,null,null,null,null,null,null,null,null,null,null,null,56,"IHT3","GUARDING",null,40]
[null,null,null,null,null,null,null,null,null,null,null,null,null,null,null,null,57,"IHT3","MOVING",null,70]
[null,null,null,null,null,null,null,null,null,null,null,{"$f":"IF(B38=\"-\",\"-\",IF(B38>S58,\"EXCELLENT\",IF(B38>T58,\"TRES BON\",IF(B38>U58,\"BON\",IF(B38>V58,\"insuffisant\",IF(B37>0.1,\"insuffisant \",\"éliminé \"))))))","v":"-"},null,null,null,null,58,"IHT3","DIFFICULT PASS",null,30]
[null,null,null,null,null,null,null,null,null,null,null,null,null,null,null,null,59,"IHT3","BEHAVIOUR",null,10]
[]
[null,null,null,null,null,null,null,null,null,null,null,null,null,null,null,null,"IHT1",100,{"$f":"R58*89.999/100","v":89.998999999999995},{"$f":"R58*79.999/100","v":79.998999999999995},{"$f":"R58*69.999/100","v":69.998999999999995},{"$f":"R58*59.999/100","v":59.999000000000002},0.1]
[null,null,null,null,null,null,null,null,null,null,null,null,null,null,null,null,"iIHT2",120,{"$f":"R59*89.999/100","v":107.99879999999999},{"$f":"R59*79.999/100","v":95.998799999999989},{"$f":"R59*69.999/100","v":83.998799999999989},{"$f":"R59*59.999/100","v":71.998800000000003},0.1]
[null,null,null,null,null,null,null,null,null,null,null,null,null,null,null,null,"IHT3",150,134.99849999999998,{"$f":"R60*79.999/100","v":119.99849999999998},{"$f":"R60*69.999/100","v":104.99849999999998},{"$f":"R60*59.999/100","v":89.998500000000007},0.1]

{"sheet":"17","index":22,"n_rows":60,"n_cols":23,"rows_kept":60,"cut":false,"hidden":false,"merged":[[2,1,2,10],[4,6,4,8],[6,2,6,3],[6,4,6,10],[7,4,7,10],[8,2,8,3],[8,4,8,10],[13,0,13,1],[13,2,13,3],[13,4,13,5],[13,6,13,7],[13,8,13,9],[13,10,13,11],[9,2,9,3],[9,4,9,10],[10,2,10,3],[10,4,10,10],[11,2,11,3],[11,4,11,10],[14,4,14,5],[14,6,14,7],[14,8,14,9],[14,10,14,11],[15,4,15,5],[15,6,15,7],[15,8,15,9],[15,10,15,11],[12,4,12,10],[18,4,18,5],[18,6,18,7],[18,8,18,9],[18,10,18,11],[19,4,19,5],[19,6,19,7],[19,8,19,9],[19,10,19,11],[16,4,16,5],[16,6,16,7],[16,8,16,9],[16,10,16,11],[17,4,17,5],[17,6,17,7],[17,8,17,9],[17,10,17,11],[22,4,22,5],[22,6,22,7],[22,8,22,9],[22,10,22,11],[23,4,23,5],[23,6,23,7],[23,8,23,9],[23,10,23,11],[20,4,20,5],[20,6,20,7],[20,8,20,9],[20,10,20,11],[21,4,21,5],[21,6,21,7],[21,8,21,9],[21,10,21,11],[26,4,26,5],[26,6,26,7],[26,8,26,9],[26,10,26,11],[27,4,27,5],[27,6,27,7],[27,8,27,9],[27,10,27,11],[24,4,24,5],[24,6,24,7],[24,8,24,9],[24,10,24,11],[25,4,25,5],[25,6,25,7],[25,8,25,9],[25,10,25,11],[30,4,30,5],[30,6,30,7],[30,8,30,9],[30,10,30,11],[31,4,31,5],[31,6,31,7],[31,8,31,9],[31,10,31,11],[28,4,28,5],[28,6,28,7],[28,8,28,9],[28,10,28,11],[29,4,29,5],[29,6,29,7],[29,8,29,9],[29,10,29,11],[34,4,34,5],[34,6,34,7],[34,8,34,9],[34,10,34,11],[35,4,35,5],[35,6,35,7],[35,8,35,9],[35,10,35,11],[32,4,32,5],[32,6,32,7],[32,8,32,9],[32,10,32,11],[33,4,33,5],[33,6,33,7],[33,8,33,9],[33,10,33,11],[38,1,38,2],[38,3,38,11],[39,1,39,11],[44,18,44,19],[45,18,45,19],[46,18,46,19],[36,1,36,2],[36,4,36,7],[36,8,36,11],[37,1,37,2],[37,3,37,4],[37,5,37,7],[37,8,37,10],[53,18,53,19],[54,18,54,19],[55,18,55,19],[47,18,47,19],[48,18,48,19],[49,18,49,19],[50,18,50,19],[51,18,51,19],[52,18,52,19]]}
[null,null,null,null,null,null,"IHT TS","HWT"]
[]
[]
[]
[null,"IHT TS ",null,null,null,null,"COUNTRY LOGO"]
["Organisation",{"$f":"'Fiche organisateur N2'!F5","v":0}]
["Ville",{"$f":"'Fiche organisateur N2'!F6","v":0},"Date : ",null,{"$f":"'Fiche organisateur N2'!$H$8","v":0}]
["Contact : ",0]
["Propriètaire",{"$f":"'Fiche organisateur N2'!$C$33","v":0},"Race et sexe",null,{"$f":"'Fiche organisateur N2'!$G$33","v":0}]
["Conducteur",{"$f":"'Fiche organisateur N2'!$D$33","v":0},"Né",null,{"$f":"'Fiche organisateur N2'!$K$33","v":0}]
["Nom du chien",{"$f":"'Fiche organisateur N2'!$E$33","v":0},"PEDIGREE",null,{"$f":"'Fiche organisateur N2'!$J$33","v":0}]
["Affixe",{"$f":"'Fiche organisateur N2'!$F$33","v":0},"Identifiant ",null,{"$f":"'Fiche organisateur N2'!$L$33","v":0}]
[]
["for the country--->"]
["EXERCISES ","OBSERVATIONS","Mini","SCORE","GUARDING",null,"MOVING",null,"DIFFICULT PASSAGES",null,"BEHAVIOUR"]
[{"$f":"'00'!A16","v":0},null,null,{"$f":"IF(COUNT(E16:L16)=0,\"-\",E16+G16+I16+K16-C16)","v":0},{"$f":"'00'!E16","v":0},null,{"$f":"'00'!G16","v":0},null,{"$f":"'00'!I16","v":0},null,{"$f":"'00'!K16","v":0}]
[0,null,null,0,{"$f":"'00'!E17","v":0},null,{"$f":"'00'!G17","v":0},null,{"$f":"'00'!I17","v":0},null,{"$f":"'00'!K17","v":0}]
[{"$f":"'00'!A18","v":0},null,null,0,{"$f":"'00'!E18","v":0},null,{"$f":"'00'!G18","v":0},null,{"$f":"'00'!I18","v":0},null,{"$f":"'00'!K18","v":0}]
[{"$f":"'00'!A19","v":0},null,null,0,{"$f":"'00'!E19","v":0},null,{"$f":"'00'!G19","v":0},null,{"$f":"'00'!I19","v":0},null,{"$f":"'00'!K19","v":0}]
[{"$f":"'00'!A20","v":0},null,null,0,{"$f":"'00'!E20","v":0},null,{"$f":"'00'!G20","v":0},null,{"$f":"'00'!I20","v":0},null,{"$f":"'00'!K20","v":0}]
[{"$f":"'00'!A21","v":0},null,null,0,{"$f":"'00'!E21","v":0},null,{"$f":"'00'!G21","v":0},null,{"$f":"'00'!I21","v":0},null,{"$f":"'00'!K21","v":0}]
[{"$f":"'00'!A22","v":0},null,null,0,{"$f":"'00'!E22","v":0},null,{"$f":"'00'!G22","v":0},null,{"$f":"'00'!I22","v":0},null,{"$f":"'00'!K22","v":0}]
[{"$f":"'00'!A23","v":0},null,null,0,{"$f":"'00'!E23","v":0},null,{"$f":"'00'!G23","v":0},null,{"$f":"'00'!I23","v":0},null,{"$f":"'00'!K23","v":0}]
[{"$f":"'00'!A24","v":0},null,null,0,{"$f":"'00'!E24","v":0},null,{"$f":"'00'!G24","v":0},null,{"$f":"'00'!I24","v":0},null,{"$f":"'00'!K24","v":0}]
[{"$f":"'00'!A25","v":0},null,null,0,{"$f":"'00'!E25","v":0},null,{"$f":"'00'!G25","v":0},null,{"$f":"'00'!I25","v":0},null,{"$f":"'00'!K25","v":0}]
[{"$f":"'00'!A26","v":0},null,null,0,{"$f":"'00'!E26","v":0},null,{"$f":"'00'!G26","v":0},null,{"$f":"'00'!I26","v":0},null,{"$f":"'00'!K26","v":0}]
[{"$f":"'00'!A27","v":0},null,null,0,{"$f":"'00'!E27","v":0},null,{"$f":"'00'!G27","v":0},null,{"$f":"'00'!I27","v":0},null,{"$f":"'00'!K27","v":0}]
[{"$f":"'00'!A28","v":0},null,null,0,{"$f":"'00'!E28","v":0},null,{"$f":"'00'!G28","v":0},null,{"$f":"'00'!I28","v":0},null,{"$f":"'00'!K28","v":0}]
[{"$f":"'00'!A29","v":0},null,null,0,{"$f":"'00'!E29","v":0},null,{"$f":"'00'!G29","v":0},null,{"$f":"'00'!I29","v":0},null,{"$f":"'00'!K29","v":0}]
[{"$f":"'00'!A30","v":0},null,null,0,{"$f":"'00'!E30","v":0},null,{"$f":"'00'!G30","v":0},null,{"$f":"'00'!I30","v":0},null,{"$f":"'00'!K30","v":0}]
[{"$f":"'00'!A31","v":0},null,null,0,{"$f":"'00'!E31","v":0},null,{"$f":"'00'!G31","v":0},null,{"$f":"'00'!I31","v":0},null,{"$f":"'00'!K31","v":0}]
[{"$f":"'00'!A32","v":"Aptitude naturelle"},null,null,0,{"$f":"'00'!E32","v":0},null,{"$f":"'00'!G32","v":0},null,{"$f":"'00'!I32","v":0},null,{"$f":"'00'!K32","v":0}]
[{"$f":"'00'!A33","v":"Gentillesse"},null,null,0,{"$f":"'00'!E33","v":0},null,{"$f":"'00'!G33","v":0},null,{"$f":"'00'!I33","v":0},null,{"$f":"'00'!K33","v":0}]
[{"$f":"'00'!A34","v":"Intelligence de l'execution"},null,null,0,{"$f":"'00'!E34","v":0},null,{"$f":"'00'!G34","v":0},null,{"$f":"'00'!I34","v":0},null,{"$f":"'00'!K34","v":0}]
[{"$f":"'00'!A35","v":"Obéissance"},null,null,0,{"$f":"'00'!E35","v":0},null,{"$f":"'00'!G35","v":0},null,{"$f":"'00'!I35","v":0},null,{"$f":"'00'!K35","v":0}]
["POINTS TOTAL",null,{"$f":"SUM(C16:C35)","v":0},{"$f":"SUM(D16:D35)","v":0},{"$f":"'00'!E36","v":50},null,{"$f":"'00'!G36","v":30},null,{"$f":"'00'!I36","v":0},null,{"$f":"'00'!K36","v":20}]
["Détails des pénéalités ",null,null,"0","Pénalités en Négatif",null,null,null,"RANKING"]
[" POINTS",{"$f":"IF((C36)=0,\"-\",D36+D37)","v":"-"},{"$f":"IF(COUNT(D38:K38)=0,\"-\",D38+F38+H38+J38-B38)","v":"-"},"EVALUATION",null,{"$f":"$L$55","v":"-"},null,null,{"$f":"'Rapport de concours '!N33","v":"X"},null,null,{"$f":"COUNT(S17:S34)","v":0}]
["CACIT / RCACIT  / CACT  / RCACT  :",".",null," <== UPON JUDGE'S DECISION"]
["Observations :  ",null,null,null,null,null,null,null,null,null,null,null,null,null,null,null,0]
[]
[]
[]
[]
[null,null,null,null,null,null,null,null,null,null,null,null,null,null,null,null,48,"IHT1","GUARDING",null,35]
[null,null,null,null,null,null,null,null,null,null,null,null,null,null,null,null,49,"IHT1","MOVING",null,45]
[null,null,null,null,null,null,null,null,null,null,null,null,null,null,null,null,50,"IHT1","DIFFICULT PASS",null,10]
[null,null,null,null,null,null,null,null,null,null,null,null,null,null,null,null,51,"IHT1","BEHAVIOUR",null,10]
[null,null,null,null,null,null,null,null,null,null,null,null,null,null,null,null,52,"IHT2","GUARDING",null,35]
[null,null,null,null,null,null,null,null,null,null,null,null,null,null,null,null,53,"IHT2","MOVING",null,55]
[null,null,null,null,null,null,null,null,null,null,null,null,null,null,null,null,54,"IHT2","DIFFICULT PASS",null,20]
[null,null,null,null,null,null,null,null,null,null,null,null,null,null,null,null,55,"IHT2","BEHAVIOUR",null,10]
[null,null,null,null,null,null,null,null,null,null,null,null,null,null,null,null,56,"IHT3","GUARDING",null,40]
[null,null,null,null,null,null,null,null,null,null,null,null,null,null,null,null,57,"IHT3","MOVING",null,70]
[null,null,null,null,null,null,null,null,null,null,null,{"$f":"IF(B38=\"-\",\"-\",IF(B38>S58,\"EXCELLENT\",IF(B38>T58,\"TRES BON\",IF(B38>U58,\"BON\",IF(B38>V58,\"insuffisant\",IF(B37>0.1,\"insuffisant \",\"éliminé \"))))))","v":"-"},null,null,null,null,58,"IHT3","DIFFICULT PASS",null,30]
[null,null,null,null,null,null,null,null,null,null,null,null,null,null,null,null,59,"IHT3","BEHAVIOUR",null,10]
[]
[null,null,null,null,null,null,null,null,null,null,null,null,null,null,null,null,"IHT1",100,{"$f":"R58*89.999/100","v":89.998999999999995},{"$f":"R58*79.999/100","v":79.998999999999995},{"$f":"R58*69.999/100","v":69.998999999999995},{"$f":"R58*59.999/100","v":59.999000000000002},0.1]
[null,null,null,null,null,null,null,null,null,null,null,null,null,null,null,null,"iIHT2",120,{"$f":"R59*89.999/100","v":107.99879999999999},{"$f":"R59*79.999/100","v":95.998799999999989},{"$f":"R59*69.999/100","v":83.998799999999989},{"$f":"R59*59.999/100","v":71.998800000000003},0.1]
[null,null,null,null,null,null,null,null,null,null,null,null,null,null,null,null,"IHT3",150,134.99849999999998,{"$f":"R60*79.999/100","v":119.99849999999998},{"$f":"R60*69.999/100","v":104.99849999999998},{"$f":"R60*59.999/100","v":89.998500000000007},0.1]

{"sheet":"18","index":23,"n_rows":60,"n_cols":23,"rows_kept":60,"cut":false,"hidden":false,"merged":[[2,1,2,10],[4,6,4,8],[6,2,6,3],[6,4,6,10],[7,4,7,10],[8,2,8,3],[8,4,8,10],[13,0,13,1],[13,2,13,3],[13,4,13,5],[13,6,13,7],[13,8,13,9],[13,10,13,11],[9,2,9,3],[9,4,9,10],[10,2,10,3],[10,4,10,10],[11,2,11,3],[11,4,11,10],[14,4,14,5],[14,6,14,7],[14,8,14,9],[14,10,14,11],[15,4,15,5],[15,6,15,7],[15,8,15,9],[15,10,15,11],[12,4,12,10],[18,4,18,5],[18,6,18,7],[18,8,18,9],[18,10,18,11],[19,4,19,5],[19,6,19,7],[19,8,19,9],[19,10,19,11],[16,4,16,5],[16,6,16,7],[16,8,16,9],[16,10,16,11],[17,4,17,5],[17,6,17,7],[17,8,17,9],[17,10,17,11],[22,4,22,5],[22,6,22,7],[22,8,22,9],[22,10,22,11],[23,4,23,5],[23,6,23,7],[23,8,23,9],[23,10,23,11],[20,4,20,5],[20,6,20,7],[20,8,20,9],[20,10,20,11],[21,4,21,5],[21,6,21,7],[21,8,21,9],[21,10,21,11],[26,4,26,5],[26,6,26,7],[26,8,26,9],[26,10,26,11],[27,4,27,5],[27,6,27,7],[27,8,27,9],[27,10,27,11],[24,4,24,5],[24,6,24,7],[24,8,24,9],[24,10,24,11],[25,4,25,5],[25,6,25,7],[25,8,25,9],[25,10,25,11],[30,4,30,5],[30,6,30,7],[30,8,30,9],[30,10,30,11],[31,4,31,5],[31,6,31,7],[31,8,31,9],[31,10,31,11],[28,4,28,5],[28,6,28,7],[28,8,28,9],[28,10,28,11],[29,4,29,5],[29,6,29,7],[29,8,29,9],[29,10,29,11],[34,4,34,5],[34,6,34,7],[34,8,34,9],[34,10,34,11],[35,4,35,5],[35,6,35,7],[35,8,35,9],[35,10,35,11],[32,4,32,5],[32,6,32,7],[32,8,32,9],[32,10,32,11],[33,4,33,5],[33,6,33,7],[33,8,33,9],[33,10,33,11],[38,1,38,2],[38,3,38,11],[39,1,39,11],[44,18,44,19],[45,18,45,19],[46,18,46,19],[36,1,36,2],[36,4,36,7],[36,8,36,11],[37,1,37,2],[37,3,37,4],[37,5,37,7],[37,8,37,10],[53,18,53,19],[54,18,54,19],[55,18,55,19],[47,18,47,19],[48,18,48,19],[49,18,49,19],[50,18,50,19],[51,18,51,19],[52,18,52,19]]}
[null,null,null,null,null,null,"IHT TS","HWT"]
[]
[]
[]
[null,"IHT TS ",null,null,null,null,"COUNTRY LOGO"]
["Organisation",{"$f":"'Fiche organisateur N2'!F5","v":0}]
["Ville",{"$f":"'Fiche organisateur N2'!F6","v":0},"Date : ",null,{"$f":"'Fiche organisateur N2'!$H$8","v":0}]
["Contact : ",0]
["Propriètaire",{"$f":"'Fiche organisateur N2'!$C$34","v":0},"Race et sexe",null,{"$f":"'Fiche organisateur N2'!$G$34","v":0}]
["Conducteur",{"$f":"'Fiche organisateur N2'!$D$34","v":0},"Né",null,{"$f":"'Fiche organisateur N2'!$K$34","v":0}]
["Nom du chien",{"$f":"'Fiche organisateur N2'!$E$34","v":0},"PEDIGREE",null,{"$f":"'Fiche organisateur N2'!$J$34","v":0}]
["Affixe",{"$f":"'Fiche organisateur N2'!$F$34","v":0},"Identifiant ",null,{"$f":"'Fiche organisateur N2'!$L$34","v":0}]
[]
["for the country--->"]
["EXERCISES ","OBSERVATIONS","Mini","SCORE","GUARDING",null,"MOVING",null,"DIFFICULT PASSAGES",null,"BEHAVIOUR"]
[{"$f":"'00'!A16","v":0},null,null,{"$f":"IF(COUNT(E16:L16)=0,\"-\",E16+G16+I16+K16-C16)","v":0},{"$f":"'00'!E16","v":0},null,{"$f":"'00'!G16","v":0},null,{"$f":"'00'!I16","v":0},null,{"$f":"'00'!K16","v":0}]
[0,null,null,0,{"$f":"'00'!E17","v":0},null,{"$f":"'00'!G17","v":0},null,{"$f":"'00'!I17","v":0},null,{"$f":"'00'!K17","v":0}]
[{"$f":"'00'!A18","v":0},null,null,0,{"$f":"'00'!E18","v":0},null,{"$f":"'00'!G18","v":0},null,{"$f":"'00'!I18","v":0},null,{"$f":"'00'!K18","v":0}]
[{"$f":"'00'!A19","v":0},null,null,0,{"$f":"'00'!E19","v":0},null,{"$f":"'00'!G19","v":0},null,{"$f":"'00'!I19","v":0},null,{"$f":"'00'!K19","v":0}]
[{"$f":"'00'!A20","v":0},null,null,0,{"$f":"'00'!E20","v":0},null,{"$f":"'00'!G20","v":0},null,{"$f":"'00'!I20","v":0},null,{"$f":"'00'!K20","v":0}]
[{"$f":"'00'!A21","v":0},null,null,0,{"$f":"'00'!E21","v":0},null,{"$f":"'00'!G21","v":0},null,{"$f":"'00'!I21","v":0},null,{"$f":"'00'!K21","v":0}]
[{"$f":"'00'!A22","v":0},null,null,0,{"$f":"'00'!E22","v":0},null,{"$f":"'00'!G22","v":0},null,{"$f":"'00'!I22","v":0},null,{"$f":"'00'!K22","v":0}]
[{"$f":"'00'!A23","v":0},null,null,0,{"$f":"'00'!E23","v":0},null,{"$f":"'00'!G23","v":0},null,{"$f":"'00'!I23","v":0},null,{"$f":"'00'!K23","v":0}]
[{"$f":"'00'!A24","v":0},null,null,0,{"$f":"'00'!E24","v":0},null,{"$f":"'00'!G24","v":0},null,{"$f":"'00'!I24","v":0},null,{"$f":"'00'!K24","v":0}]
[{"$f":"'00'!A25","v":0},null,null,0,{"$f":"'00'!E25","v":0},null,{"$f":"'00'!G25","v":0},null,{"$f":"'00'!I25","v":0},null,{"$f":"'00'!K25","v":0}]
[{"$f":"'00'!A26","v":0},null,null,0,{"$f":"'00'!E26","v":0},null,{"$f":"'00'!G26","v":0},null,{"$f":"'00'!I26","v":0},null,{"$f":"'00'!K26","v":0}]
[{"$f":"'00'!A27","v":0},null,null,0,{"$f":"'00'!E27","v":0},null,{"$f":"'00'!G27","v":0},null,{"$f":"'00'!I27","v":0},null,{"$f":"'00'!K27","v":0}]
[{"$f":"'00'!A28","v":0},null,null,0,{"$f":"'00'!E28","v":0},null,{"$f":"'00'!G28","v":0},null,{"$f":"'00'!I28","v":0},null,{"$f":"'00'!K28","v":0}]
[{"$f":"'00'!A29","v":0},null,null,0,{"$f":"'00'!E29","v":0},null,{"$f":"'00'!G29","v":0},null,{"$f":"'00'!I29","v":0},null,{"$f":"'00'!K29","v":0}]
[{"$f":"'00'!A30","v":0},null,null,0,{"$f":"'00'!E30","v":0},null,{"$f":"'00'!G30","v":0},null,{"$f":"'00'!I30","v":0},null,{"$f":"'00'!K30","v":0}]
[{"$f":"'00'!A31","v":0},null,null,0,{"$f":"'00'!E31","v":0},null,{"$f":"'00'!G31","v":0},null,{"$f":"'00'!I31","v":0},null,{"$f":"'00'!K31","v":0}]
[{"$f":"'00'!A32","v":"Aptitude naturelle"},null,null,0,{"$f":"'00'!E32","v":0},null,{"$f":"'00'!G32","v":0},null,{"$f":"'00'!I32","v":0},null,{"$f":"'00'!K32","v":0}]
[{"$f":"'00'!A33","v":"Gentillesse"},null,null,0,{"$f":"'00'!E33","v":0},null,{"$f":"'00'!G33","v":0},null,{"$f":"'00'!I33","v":0},null,{"$f":"'00'!K33","v":0}]
[{"$f":"'00'!A34","v":"Intelligence de l'execution"},null,null,0,{"$f":"'00'!E34","v":0},null,{"$f":"'00'!G34","v":0},null,{"$f":"'00'!I34","v":0},null,{"$f":"'00'!K34","v":0}]
[{"$f":"'00'!A35","v":"Obéissance"},null,null,0,{"$f":"'00'!E35","v":0},null,{"$f":"'00'!G35","v":0},null,{"$f":"'00'!I35","v":0},null,{"$f":"'00'!K35","v":0}]
["POINTS TOTAL",null,{"$f":"SUM(C16:C35)","v":0},{"$f":"SUM(D16:D35)","v":0},{"$f":"'00'!E36","v":50},null,{"$f":"'00'!G36","v":30},null,{"$f":"'00'!I36","v":0},null,{"$f":"'00'!K36","v":20}]
["Détails des pénéalités ",null,null,"0","Pénalités en Négatif",null,null,null,"RANKING"]
[" POINTS",{"$f":"IF((C36)=0,\"-\",D36+D37)","v":"-"},{"$f":"IF(COUNT(D38:K38)=0,\"-\",D38+F38+H38+J38-B38)","v":"-"},"EVALUATION",null,{"$f":"$L$55","v":"-"},null,null,{"$f":"'Rapport de concours '!N34","v":"X"},null,null,{"$f":"COUNT(S17:S34)","v":0}]
["CACIT / RCACIT  / CACT  / RCACT  :",null,null," <== UPON JUDGE'S DECISION"]
["Observations :  ",null,null,null,null,null,null,null,null,null,null,null,null,null,null,null,0]
[]
[]
[]
[]
[null,null,null,null,null,null,null,null,null,null,null,null,null,null,null,null,48,"IHT1","GUARDING",null,35]
[null,null,null,null,null,null,null,null,null,null,null,null,null,null,null,null,49,"IHT1","MOVING",null,45]
[null,null,null,null,null,null,null,null,null,null,null,null,null,null,null,null,50,"IHT1","DIFFICULT PASS",null,10]
[null,null,null,null,null,null,null,null,null,null,null,null,null,null,null,null,51,"IHT1","BEHAVIOUR",null,10]
[null,null,null,null,null,null,null,null,null,null,null,null,null,null,null,null,52,"IHT2","GUARDING",null,35]
[null,null,null,null,null,null,null,null,null,null,null,null,null,null,null,null,53,"IHT2","MOVING",null,55]
[null,null,null,null,null,null,null,null,null,null,null,null,null,null,null,null,54,"IHT2","DIFFICULT PASS",null,20]
[null,null,null,null,null,null,null,null,null,null,null,null,null,null,null,null,55,"IHT2","BEHAVIOUR",null,10]
[null,null,null,null,null,null,null,null,null,null,null,null,null,null,null,null,56,"IHT3","GUARDING",null,40]
[null,null,null,null,null,null,null,null,null,null,null,null,null,null,null,null,57,"IHT3","MOVING",null,70]
[null,null,null,null,null,null,null,null,null,null,null,{"$f":"IF(B38=\"-\",\"-\",IF(B38>S58,\"EXCELLENT\",IF(B38>T58,\"TRES BON\",IF(B38>U58,\"BON\",IF(B38>V58,\"insuffisant\",IF(B37>0.1,\"insuffisant \",\"éliminé \"))))))","v":"-"},null,null,null,null,58,"IHT3","DIFFICULT PASS",null,30]
[null,null,null,null,null,null,null,null,null,null,null,null,null,null,null,null,59,"IHT3","BEHAVIOUR",null,10]
[]
[null,null,null,null,null,null,null,null,null,null,null,null,null,null,null,null,"IHT1",100,{"$f":"R58*89.999/100","v":89.998999999999995},{"$f":"R58*79.999/100","v":79.998999999999995},{"$f":"R58*69.999/100","v":69.998999999999995},{"$f":"R58*59.999/100","v":59.999000000000002},0.1]
[null,null,null,null,null,null,null,null,null,null,null,null,null,null,null,null,"iIHT2",120,{"$f":"R59*89.999/100","v":107.99879999999999},{"$f":"R59*79.999/100","v":95.998799999999989},{"$f":"R59*69.999/100","v":83.998799999999989},{"$f":"R59*59.999/100","v":71.998800000000003},0.1]
[null,null,null,null,null,null,null,null,null,null,null,null,null,null,null,null,"IHT3",150,134.99849999999998,{"$f":"R60*79.999/100","v":119.99849999999998},{"$f":"R60*69.999/100","v":104.99849999999998},{"$f":"R60*59.999/100","v":89.998500000000007},0.1]